program: Gaussian 09
title: 000210882
version: EM64L-G09RevD.01
frameworkgroup: C1[X(C13H14N2)]
method: RPBEPBE
basis: SDD
operation: Freq
keyword: #pfreq=noraman
keyword: PBEPBE/SDD
title: #p freq=noraman PBEPBE/SDD
converged: YES YES NO NO
title: Mulliken charges:
elementType: N N C C C C C C C C C C C C C H H H H H H H H H H H H H H
charge: -0.092499 -0.413259 0.353696 -0.473189 0.103834 0.241689 -0.413270 -0.417959 -0.353931 -0.420082 -0.644243 -0.254714 -0.219715 0.200267 -0.496999 0.219616 0.193494 0.287742 0.303782 0.228727 0.225935 0.239413 0.203342 0.250470 0.185774 0.247603 0.218958 0.220304 0.275214
chargesum: 0.00000
title: Mulliken charges with hydrogens summed into heavy atoms:
elementType: N N C C C C C C C C C C C C C
charge: -0.092499 -0.109477 0.353696 -0.060079 0.103834 0.241689 -0.125527 -0.189232 -0.127997 0.022673 0.039604 -0.035756 0.000589 0.200267 -0.221785
polarizability: 2.23621673e+02 -1.96769534e+01 1.45282817e+02 5.63684773e+00 1.80023459e+00 8.35221225e+01
1716.lowfreq: -11.9368 -0.0006 -0.0005 0.0004 5.3055 6.1284 24.4167 42.0961 80.3770
frequency: 24.1014 42.0058 80.3631 93.2506 142.7601 172.4499 217.3290 222.1908 229.8826 289.8946 325.1973 330.8358 335.1673 372.3635 421.8420 451.5842 514.6027 534.8119 568.8126 577.2004 600.4613 627.8635 630.8811 662.1845 735.8471 747.0166 760.5091 772.5905 814.3891 830.2273 849.0064 866.6726 928.9879 943.6621 960.8151 969.0991 981.1777 1010.9500 1022.1212 1059.4755 1085.9706 1116.2690 1129.0402 1142.3941 1166.2142 1178.3322 1235.8317 1238.0618 1262.1329 1274.7132 1291.1867 1315.5290 1347.1576 1374.2283 1399.6426 1421.8305 1430.6172 1452.0293 1460.6294 1469.8768 1476.5048 1478.1031 1482.6232 1563.5823 1585.5533 1632.1920 2144.2869 2819.5682 2837.7652 2865.2635 2975.5605 3003.7608 3044.1782 3102.4352 3121.5108 3128.8811 3143.0324 3161.2259 3234.4700 3426.8077 3612.4506
redmass: 4.2831 4.4510 3.0061 3.5475 4.2164 3.3850 4.0098 3.9288 1.0900 4.1034 3.6150 1.9901 4.0885 2.9959 2.8179 3.9554 1.2679 5.9474 5.3108 3.0338 3.7196 1.2698 3.5389 1.2468 4.6599 1.3452 3.9680 4.2609 2.8213 1.7202 1.4894 4.9682 1.3801 3.5573 1.6849 1.3036 2.1130 2.1086 2.4184 2.8608 1.5341 1.3282 1.4520 2.8625 1.0930 1.3798 2.1408 1.8447 1.4336 1.4619 2.3649 1.5021 1.5942 1.7987 3.3664 1.8010 1.3411 1.0863 4.5087 1.0678 1.0519 1.0758 3.0279 6.1667 6.1531 6.8902 6.0257 1.0704 1.0704 1.0570 1.0857 1.0846 1.0722 1.1014 1.0847 1.0889 1.0952 1.1001 1.0985 1.1594 1.0808
irintensity: 0.4450 0.3448 1.6396 1.8875 0.7582 1.6286 0.5925 8.3233 2.4905 0.7605 2.1799 13.0562 2.9592 3.4730 12.6961 4.2558 90.5861 0.9872 4.7263 8.7491 3.1680 74.7276 2.6746 65.2663 6.1598 106.8935 4.1206 4.1608 14.6799 31.2395 0.9014 1.2533 2.7873 5.7509 2.8094 0.0588 5.9674 14.6622 105.7010 1.5987 34.3529 4.0692 1.7631 9.3521 0.9957 4.6545 27.9137 1.2956 4.9213 14.0796 2.8758 39.5854 9.5027 30.3099 29.5737 5.3136 11.8424 2.1316 26.0453 0.4866 4.1764 21.1499 0.9396 6.6282 0.9030 1.3502 1.9300 61.1694 84.6764 131.1931 33.5330 19.9198 23.5934 22.5644 2.2046 4.5035 39.8540 31.5017 0.0461 65.6293 55.6875
temp: 298.150 k
press: 1.00000 atm
elementType: 7 7 6 6 6 6 6 6 6 6 6 6 6 6 6 1 1 1 1 1 1 1 1 1 1 1 1 1 1
symmnumber: 1
zpe: 618182.4 jmol-1
zpe.correction: 0.235453 hartree
zpe.thermalcorrener: 0.249447 hartree
zpe.thermalcorrenthalpy: 0.250392 hartree
zpe.thermalcorrgfe: 0.193872 hartree
zpe.sumelectzpe: -612.127561 hartree
zpe.sumelectthermal: -612.113566 hartree
zpe.sumelectthermalent: -612.112622 hartree
zpe.sumelectthermalfe: -612.169142 hartree
dipole: 0.2011 1.0993 0.1400
dipole: 1.1263
quadrupole: -84.9462 -75.5701 -92.4977
quadrupole: 4.9617 0.0703 1.5276
quadrupole: -0.6082 8.7679 -8.1597 4.9617 0.0703 1.5276
hfenergy: -612.3630138 hartree
pointgroup: C01 [X(C13H14N2)]
dipole: 0.083695 -0.4237367 -0.0990057 debye
polarizability: 223.2726806|20.8507366|144.6390081|-2.853825|8.1972362|84.5149242 unknown
InChI: InChI=1S/C13H14N2/c1-3-8-15(2)10-11-9-14-13-7-5-4-6-12(11)13/h1,4-7,9,14H,8,10H2,2H3
charge 0 multiplicity 1
29 atoms
N  -2.250915 0.108279 -0.014258
N  1.54232 -1.99372 -0.040346
C  0.199944 -0.179919 0.319837
C  -1.01851 0.66319 0.608655
C  1.571395 0.27992 0.185191
C  2.394264 -0.882899 -0.040955
C  0.22372 -1.566875 0.179516
C  2.191736 1.558199 0.229844
C  3.792719 -0.799155 -0.219895
C  -3.470568 0.701257 0.595321
C  -2.24545 0.230652 -1.489359
C  3.585541 1.648199 0.049484
C  4.378286 0.482392 -0.172377
C  -4.719216 0.046351 0.159717
C  -5.785248 -0.469321 -0.182919
H  -1.19331 0.708662 1.703402
H  -0.824776 1.717354 0.27865
H  -0.611415 -2.263215 0.209128
H  1.829885 -2.957637 -0.19231
H  1.597699 2.462742 0.403429
H  4.405729 -1.691726 -0.389555
H  -3.384398 0.603649 1.695291
H  -3.559496 1.798444 0.374835
H  -1.340292 -0.254484 -1.889531
H  -2.254266 1.295907 -1.833109
H  -3.131951 -0.276609 -1.905278
H  4.075593 2.62784 0.080137
H  5.46085 0.586082 -0.306932
H  -6.710269 -0.926359 -0.483717
