program: Gaussian 09
title: 000216254
version: EM64L-G09RevD.01
frameworkgroup: C1[X(C19H22N2O2)]
method: RPBEPBE
basis: SDD
operation: Freq
keyword: #p
keyword: freq=noraman
keyword: PBEPBE/SDD
title: #p freq=noraman PBEPBE/SDD
converged: YES YES NO NO
title: Mulliken charges:
elementType: O O N N C C C C C C C C C C C C C C C C C C C H H H H H H H H H H H H H H H H H H H H H H
charge: -0.447025 -0.266597 -0.235033 -0.571095 0.198842 0.174373 0.234034 0.200221 -0.573633 -0.537446 -0.803985 -0.609628 -0.329515 0.483582 -0.398606 0.281196 -0.377092 -0.408176 -0.380986 -0.350383 -0.356217 0.318595 -0.538285 0.235427 0.232829 0.197853 0.224390 0.253124 0.245762 0.230820 0.222900 0.234200 0.201449 0.216196 0.244899 0.230085 0.261209 0.274932 0.258794 0.250445 0.242525 0.346274 0.222059 0.245095 0.221592
chargesum: 0.00000
title: Mulliken charges with hydrogens summed into heavy atoms:
elementType: O O N N C C C C C C C C C C C C C C C C C C C
charge: -0.100751 -0.266597 -0.235033 -0.037369 0.198842 0.174373 0.234034 0.200221 -0.105377 -0.115203 -0.074279 -0.386727 -0.095315 0.483582 0.019038 0.281196 -0.132193 -0.178090 -0.119777 -0.099938 -0.113693 0.318595 0.150461
polarizability: 2.84703284e+02 -2.25108066e+01 2.32382895e+02 -1.59364468e+01 1.10159060e+01 1.82121822e+02
1716.lowfreq: -7.6275 -2.2628 -0.0008 -0.0006 -0.0005 4.7542 14.5469 15.7142 24.1691
frequency: 14.4640 15.5945 24.1347 28.0934 72.1030 80.0070 82.5799 104.8540 114.5598 136.0491 157.5430 172.1982 197.7521 207.3612 224.8910 229.1430 258.6297 265.6401 283.2582 292.1043 316.4182 328.7029 338.1364 359.5165 388.9435 409.3024 412.6501 430.7482 434.8874 459.2891 503.8053 524.6002 556.0232 581.0812 593.8725 605.6430 626.8975 640.5361 666.9469 700.3177 715.0488 720.4695 738.1444 749.4269 784.5511 795.7940 807.2908 816.8514 824.3069 830.1052 846.5490 902.2661 923.9656 934.1033 941.7855 962.2760 972.7905 987.8488 1001.8087 1012.7751 1036.7662 1043.0754 1069.1038 1096.9803 1112.3880 1113.7418 1117.4245 1131.1544 1141.8639 1156.1651 1172.8417 1179.9277 1200.6114 1209.3479 1225.3947 1231.4502 1237.1151 1265.5069 1285.4981 1299.3397 1304.9351 1328.3465 1330.8809 1370.0898 1375.5526 1393.3887 1396.8139 1418.5568 1419.7805 1430.6094 1436.5091 1461.0589 1466.2692 1469.4526 1470.5687 1472.6131 1472.8092 1477.0579 1484.1931 1491.9523 1503.3241 1581.1033 1586.2303 1597.8110 1625.3237 1629.7852 1634.8379 2885.9378 2959.1675 2960.7588 2964.8763 2988.6988 3020.0745 3034.1504 3036.3123 3044.5241 3046.8109 3095.1922 3109.5701 3115.9529 3124.8461 3135.9416 3138.4231 3162.3879 3166.5319 3173.3238 3450.5054 3577.6113 3584.7820
redmass: 4.1679 4.0307 4.3008 3.8654 3.7384 3.5307 2.1526 3.7780 3.9224 4.1683 1.1142 4.0930 2.7925 1.3041 1.2277 3.7880 2.8352 4.4882 2.3628 3.0261 1.1335 3.5187 2.8039 4.5252 4.5828 4.7943 3.1005 3.1007 5.1637 4.3595 3.0409 3.9018 4.0731 3.4699 1.4454 3.0939 6.3690 4.4188 5.3442 3.3331 4.3802 4.4363 4.0157 3.9253 1.3401 1.5110 2.9047 1.6959 1.5125 1.6680 3.0015 2.3611 1.3292 1.8337 1.4741 1.3570 1.9469 8.6954 2.7913 2.6934 1.9656 1.5542 2.3654 2.7594 1.2663 1.3916 1.5708 1.4691 1.3234 1.3445 1.9780 1.2913 2.2680 1.8786 1.8089 3.3034 1.7369 1.4707 1.1163 1.3354 1.4475 1.7077 1.9059 4.1808 1.5126 2.9960 1.4804 3.1149 3.3242 3.7042 1.1715 1.1923 1.0501 1.2367 1.4139 1.2917 1.4593 2.5506 1.2726 1.0938 2.2974 6.5834 7.0313 6.7898 6.2155 7.5114 1.0952 1.0712 1.0331 1.0657 1.0407 1.0594 1.0866 1.1018 1.0958 1.0976 1.1039 1.0957 1.0912 1.0896 1.0993 1.0890 1.0884 1.0946 1.0951 1.0951 1.0448 1.0973 1.0659
irintensity: 0.5031 0.7346 0.4481 1.1064 0.3820 2.4362 5.1076 2.4563 1.4803 2.8364 0.0311 2.4707 7.2997 36.0379 0.3630 1.8836 1.2337 2.8009 10.3907 4.1250 136.5405 2.4495 10.7415 4.4477 7.4787 5.0312 2.2190 9.4769 9.6717 1.6284 15.3096 25.8267 3.2819 24.5170 188.9231 36.5928 3.4634 5.4984 1.4640 5.1991 1.6381 6.4085 9.6783 2.6890 2.5905 34.4664 20.0642 16.2237 22.1764 38.8117 14.7326 44.4273 0.0059 4.1249 1.1466 0.0494 1.1338 40.6720 8.1525 5.1554 9.1829 3.6842 5.2662 34.5857 0.0769 7.6013 167.0025 7.4337 131.7819 1.0737 5.9017 84.4877 2.9104 24.9139 10.7361 158.7362 6.0086 11.5377 1.4562 15.2687 0.9737 44.5500 5.0605 77.5633 39.3432 8.1833 0.2659 2.4491 36.3744 32.8624 12.2564 12.2716 13.1848 34.4776 85.7906 43.5576 44.1287 35.1915 34.4933 2.5264 111.3773 9.9806 17.2273 27.2248 43.3319 40.8230 39.4887 90.3977 57.8221 42.2504 39.8631 35.6685 20.5053 9.9867 16.0495 40.2180 47.8385 15.4167 23.9309 16.4132 28.6264 14.1769 2.7309 11.9519 6.7619 7.6283 1.5032 0.1235 30.2062
temp: 298.150 k
press: 1.00000 atm
elementType: 8 8 7 7 6 6 6 6 6 6 6 6 6 6 6 6 6 6 6 6 6 6 6 1 1 1 1 1 1 1 1 1 1 1 1 1 1 1 1 1 1 1 1 1 1
symmnumber: 1
zpe: 968014.4 jmol-1
zpe.correction: 0.368697 hartree
zpe.thermalcorrener: 0.391502 hartree
zpe.thermalcorrenthalpy: 0.392446 hartree
zpe.thermalcorrgfe: 0.313887 hartree
zpe.sumelectzpe: -995.480618 hartree
zpe.sumelectthermal: -995.457813 hartree
zpe.sumelectthermalent: -995.456869 hartree
zpe.sumelectthermalfe: -995.535428 hartree
dipole: 0.3812 -1.3894 0.8085
dipole: 1.6521
quadrupole: -119.3184 -147.5320 -123.5198
quadrupole: 9.0614 0.2820 7.9348
quadrupole: 10.8050 -17.4086 6.6036 9.0614 0.2820 7.9348
hfenergy: -995.8493151 hartree
pointgroup: C01 [X(C19H22N2O2)]
dipole: 0.1246994 -0.4946646 0.4028105 debye
polarizability: 281.3883342|-27.5768842|237.6931448|-12.7655318|3.191027|180.1265216 unknown
InChI: InChI=1S/C19H22N2O2/c1-13-17(9-10-20)18-11-15(22)5-8-19(18)21(13)12-14-3-6-16(23-2)7-4-14/h3-8,11,22H,9-10,12,20H2,1-2H3
charge 0 multiplicity 1
45 atoms
O  -3.741304 4.01878 0.055326
O  5.845673 -0.361619 0.843971
N  -0.432038 -0.346832 -1.093189
N  -5.213411 -2.77159 1.558498
C  -2.126837 -0.804726 0.389199
C  -1.024758 -1.346885 -0.289159
C  -1.147754 0.852305 -0.923698
C  -2.222294 0.587655 -0.005148
C  0.773288 -0.509476 -1.91222
C  -3.069118 -1.53409 1.314808
C  -0.476388 -2.744772 -0.260454
C  -3.113804 1.638705 0.342444
C  -0.946585 2.131318 -1.487937
C  2.089582 -0.467326 -1.130841
C  -4.345004 -2.055927 0.601102
C  -2.908197 2.909663 -0.229411
C  -1.838304 3.161698 -1.135078
C  3.21945 -1.182342 -1.607303
C  2.226081 0.299955 0.047957
C  4.453214 -1.125813 -0.933857
C  3.456643 0.365645 0.740731
C  4.57571 -0.348341 0.245044
C  6.021674 0.419721 2.070417
H  0.760844 0.291897 -2.675517
H  0.708473 -1.463721 -2.468593
H  -3.378982 -0.857872 2.139281
H  -2.578738 -2.400597 1.795419
H  0.602224 -2.759247 -0.014388
H  -1.006796 -3.34175 0.499082
H  -0.600587 -3.262723 -1.232462
H  -3.942747 1.462805 1.041042
H  -0.120291 2.338391 -2.176648
H  -4.838965 -1.197975 0.084092
H  -4.04108 -2.768675 -0.188453
H  -1.728981 4.171019 -1.541949
H  3.134295 -1.793387 -2.515117
H  1.361669 0.848444 0.438247
H  -5.976854 -3.301503 1.127058
H  -5.547118 -2.186573 2.331933
H  5.328017 -1.676439 -1.292868
H  3.527535 0.966838 1.652112
H  -4.454605 3.756978 0.688313
H  5.837816 1.497142 1.891848
H  7.071287 0.265953 2.360785
H  5.35437 0.058887 2.877382
