program: Gaussian 09
title: 000210879
version: EM64L-G09RevD.01
frameworkgroup: C1[X(C7H13N7)]
method: RPBEPBE
basis: SDD
operation: Freq
keyword: #pfreq=noraman
keyword: PBEPBE/SDD
title: #p freq=noraman PBEPBE/SDD
converged: YES YES NO NO
title: Mulliken charges:
elementType: N N N N N N N C C C C C C C H H H H H H H H H H H H H
charge: -0.140108 -0.294401 -0.169329 -0.169106 -0.152625 -0.594036 -0.594007 -0.346072 -0.346091 -0.408386 -0.408485 0.186120 0.050210 0.050181 0.216142 0.258885 0.258710 0.216204 0.194031 0.213224 0.213239 0.193951 0.266933 0.327921 0.324477 0.327915 0.324503
chargesum: 0.00000
title: Mulliken charges with hydrogens summed into heavy atoms:
elementType: N N N N N N N C C C C C C C
charge: -0.140108 -0.027467 -0.169329 -0.169106 -0.152625 0.058361 0.058411 0.128955 0.128823 -0.001131 -0.001295 0.186120 0.050210 0.050181
polarizability: 1.78433283e+02 -4.83581766e-03 1.41738240e+02 -7.51391614e+00 -1.90085347e-02 7.36706293e+01
1716.lowfreq: -8.4735 -0.0003 0.0006 0.0006 8.6979 13.2973 43.1779 64.7776 135.0712
frequency: 43.1775 64.6360 135.0680 155.0754 190.9626 196.8658 246.7702 259.9708 297.0887 342.8384 381.5826 407.6812 434.3208 448.0685 452.1024 488.8323 531.8368 532.8138 533.6412 575.7243 576.8410 626.8137 676.0025 702.7176 706.2098 790.0193 824.9541 843.5639 878.3949 897.2741 911.7961 951.5330 1011.0667 1028.9887 1053.0920 1054.6632 1096.3817 1121.4258 1153.6173 1160.3957 1164.7763 1194.2765 1258.3439 1268.2252 1276.4227 1295.7919 1312.9703 1331.9496 1357.1938 1377.9858 1416.3951 1442.5701 1452.6898 1457.3326 1459.4124 1463.9080 1468.6545 1503.3525 1520.3129 1544.5000 1592.3783 1628.5774 2871.0569 2876.9311 2977.4617 2980.1988 3038.7904 3041.7520 3103.5277 3104.0559 3462.0506 3560.0483 3561.6148 3722.2495 3722.5007
redmass: 4.2325 3.4393 3.7974 7.1062 4.9975 8.2283 2.1540 2.7804 2.9019 3.4232 2.6352 2.1330 1.1911 1.2378 2.8784 2.0754 3.4820 1.0655 1.0648 5.8364 3.3596 3.6460 1.6714 9.0468 11.2595 12.4504 4.1271 1.5042 2.8300 12.5028 2.3936 2.0348 3.4595 2.2518 1.6920 1.8695 2.1871 2.4207 3.5511 2.1184 1.8506 1.0889 2.4047 1.3144 6.5150 1.5209 1.2565 1.2212 1.4429 1.4277 5.2179 1.3258 1.5664 1.0832 1.0751 1.8646 1.1110 4.8835 3.6424 2.6866 1.4065 2.3280 1.0711 1.0693 1.0673 1.0678 1.0895 1.0916 1.0940 1.0955 1.0754 1.0438 1.0442 1.1058 1.1058
irintensity: 0.9276 0.3558 0.1598 1.7673 18.8363 0.0781 3.0485 2.5532 3.4434 3.7479 1.7508 1.9145 0.1240 598.3038 1.8755 103.3760 0.0211 3.8121 0.0025 7.5157 14.2241 9.0746 81.3848 0.2089 0.0016 39.9269 0.4847 0.0241 6.0811 1.2056 2.8313 47.3349 0.4697 28.9811 0.8203 27.1829 9.5865 0.1646 26.5990 12.0853 2.7585 2.2734 7.4821 27.1107 0.9605 174.0365 36.3633 7.7126 9.3572 0.1886 0.0789 3.9092 92.0276 12.1944 0.1180 13.0244 1.8654 630.7270 743.8521 743.7295 591.8922 99.7901 55.1850 125.8858 10.6065 111.1929 59.8546 63.9669 5.6551 7.5111 1.4566 117.2898 60.9237 21.1814 63.2593
temp: 298.150 k
press: 1.00000 atm
elementType: 7 7 7 7 7 7 7 6 6 6 6 6 6 6 1 1 1 1 1 1 1 1 1 1 1 1 1
symmnumber: 1
zpe: 583748.1 jmol-1
zpe.correction: 0.222338 hartree
zpe.thermalcorrener: 0.234963 hartree
zpe.thermalcorrenthalpy: 0.235908 hartree
zpe.thermalcorrgfe: 0.183577 hartree
zpe.sumelectzpe: -656.770524 hartree
zpe.sumelectthermal: -656.757898 hartree
zpe.sumelectthermalent: -656.756954 hartree
zpe.sumelectthermalfe: -656.809285 hartree
dipole: -0.4237 0.0027 -1.1327
dipole: 1.2093
quadrupole: -70.0247 -66.8384 -85.5747
quadrupole: -0.0173 3.1997 -0.0116
quadrupole: 4.1212 7.3075 -11.4288 -0.0173 3.1997 -0.0116
hfenergy: -656.9928614 hartree
pointgroup: C01 [X(C7H13N7)]
dipole: -0.175274 0.0230033 0.4417316 debye
polarizability: 178.1034465|0.4200071|141.5410809|9.5242948|-3.6513966|74.1976245 unknown
InChI: InChI=1S/C7H13N7/c8-5-11-6(9)13-7(12-5)14-3-1-10-2-4-14/h10H,1-4,8-9H2
charge 0 multiplicity 1
27 atoms
N  -1.155991 -0.019509 -0.490392
N  -3.908228 0.024398 0.186507
N  0.83427 1.212347 -0.202957
N  0.827602 -1.225243 -0.071488
N  2.920212 0.007456 0.224971
N  2.862696 2.341615 0.088959
N  2.849682 -2.327538 0.341783
C  -1.93413 1.220432 -0.679197
C  -1.941628 -1.26753 -0.551207
C  -3.103926 1.260136 0.326892
C  -3.113218 -1.196743 0.45174
C  0.200253 -0.010738 -0.248187
C  2.180814 1.149297 0.034673
C  2.17459 -1.14422 0.158814
H  -2.345828 1.236038 -1.708639
H  -1.253752 2.074385 -0.543993
H  -1.26721 -2.107257 -0.326642
H  -2.352033 -1.386968 -1.574288
H  -2.679014 1.386557 1.353574
H  -3.743528 2.134517 0.107226
H  -3.75919 -2.084158 0.320649
H  -2.69024 -1.222182 1.486788
H  -4.783199 0.054789 0.723915
H  3.864176 2.328201 0.26022
H  2.355055 3.209897 -0.054341
H  3.851108 -2.301582 0.511937
H  2.336753 -3.203194 0.293878
