program: Gaussian 09
title: 000216331
version: EM64L-G09RevD.01
frameworkgroup: C1[X(C20H30O7)]
method: RPBEPBE
basis: SDD
operation: Freq
keyword: #pfreq=noraman
keyword: PBEPBE/SDD
title: #p freq=noraman PBEPBE/SDD
converged: YES YES NO NO
title: Mulliken charges:
elementType: O O O O O O O C C C C C C C C C C C C C C C C C C C C H H H H H H H H H H H H H H H H H H H H H H H H H H H H H H
charge: -0.206701 -0.277640 -0.453384 -0.166164 -0.242066 -0.445529 -0.238328 0.248228 -0.119980 -0.178697 -0.574096 -0.099812 -0.092231 -0.136873 -0.463507 0.044428 0.028794 -0.542505 -0.796774 -0.740948 0.194603 -0.417717 0.255339 -0.173531 -0.372711 -0.711120 -0.692173 0.234157 0.251944 0.269702 0.270772 0.220839 0.244412 0.269747 0.232721 0.236755 0.257290 0.284133 0.230778 0.250892 0.236585 0.214477 0.235256 0.216694 0.211949 0.254008 0.374320 0.377744 0.232530 0.223632 0.205620 0.219309 0.224552 0.236442 0.210175 0.222245 0.221417
chargesum: 0.00000
title: Mulliken charges with hydrogens summed into heavy atoms:
elementType: O O O O O O O C C C C C C C C C C C C C C C C C C C C
charge: -0.206701 -0.277640 -0.079064 -0.166164 -0.242066 -0.067785 -0.238328 0.248228 0.114178 0.073247 -0.033622 0.121028 0.152180 0.132874 0.005968 0.044428 0.028794 -0.001082 -0.078520 -0.074522 0.194603 0.048240 0.255339 0.058999 0.056541 -0.030817 -0.038337
polarizability: 2.85499559e+02 7.07472061e+00 2.15057441e+02 6.65308177e+00 3.21789482e+00 1.91551560e+02
1716.lowfreq: -2.1184 -0.0007 -0.0004 0.0009 6.6895 13.0319 18.2569 22.2640 29.1244
frequency: 18.1635 22.1891 29.1047 30.8190 44.5956 63.8352 79.4377 91.1102 97.0687 118.9977 131.5366 142.4341 161.2453 165.5548 180.4764 188.2810 192.5922 204.3782 225.4805 232.0092 234.4406 244.2315 255.4769 261.5799 269.4472 287.8429 305.1759 309.6046 313.6980 326.6611 345.7605 360.3849 376.3857 385.3742 403.5078 423.4857 432.2437 488.0741 497.2339 509.0379 531.6283 556.0509 575.9547 588.4881 597.1891 618.5588 640.5621 646.7693 689.4001 700.2343 703.7282 713.5224 734.7072 744.6161 785.3164 799.8272 821.5119 830.5685 835.8335 859.3756 871.4794 887.0910 909.2802 931.8968 940.9937 957.7440 960.7225 966.5876 971.1951 983.3255 1005.9862 1011.1099 1015.9995 1030.4758 1038.9270 1041.7906 1053.2889 1063.8141 1072.8712 1080.6939 1092.8490 1094.8785 1102.0699 1109.0763 1115.6751 1123.1923 1137.2304 1150.8138 1162.9668 1167.3864 1183.0830 1199.9302 1215.1940 1223.9128 1231.2687 1249.6659 1259.5043 1260.2873 1273.5079 1277.5946 1287.9027 1289.7488 1304.1391 1314.0856 1321.8747 1326.1653 1328.5803 1335.9849 1337.3344 1353.8293 1356.8928 1362.2793 1367.3361 1375.7528 1385.5174 1388.9369 1390.0400 1391.1087 1397.9143 1423.9038 1454.5527 1461.1890 1463.8345 1473.0604 1474.8309 1475.8791 1477.7922 1477.9646 1479.3590 1480.7880 1482.1271 1500.4530 1635.0997 1650.6418 1660.2278 2955.2114 2974.5932 2976.7719 2982.0400 2984.4722 2984.5001 2985.8256 2988.5202 2988.9160 3001.1493 3013.0127 3015.7672 3023.1841 3027.8413 3038.8805 3044.3896 3070.8668 3071.1734 3074.1543 3076.9890 3079.0354 3079.8566 3081.7378 3086.1717 3087.0780 3087.4367 3093.9570 3095.9966 3410.6896 3427.0781
redmass: 4.5954 3.8752 4.9222 5.0968 5.9443 5.3550 4.3111 2.6083 3.4890 4.7241 3.1799 4.1494 3.3048 4.3726 2.1044 3.0266 2.5625 2.2104 1.1093 1.7617 1.7955 3.6297 2.6922 2.7240 1.3969 3.0851 4.8931 2.9853 3.8027 3.7660 4.2283 3.1261 3.3547 3.2744 3.1375 4.6208 3.4830 2.6082 2.8490 1.6379 2.0272 3.1967 3.3067 4.1158 3.1420 3.6702 2.8763 2.3851 2.2847 2.5087 5.4023 5.6125 5.5428 3.2472 2.0494 2.1345 2.1351 2.7980 2.6223 2.7191 2.9087 2.4577 2.1303 3.1617 1.9885 2.3102 2.0951 1.3340 3.0758 2.2342 2.0503 1.8920 2.2386 2.8412 2.2675 2.1820 3.0528 3.2004 2.7617 2.6113 2.5319 2.9949 1.8935 1.7263 2.2001 2.0350 2.6437 2.0084 2.2942 2.1639 2.4358 1.5781 1.4906 1.8518 1.5047 1.6013 1.2605 1.5699 1.3782 1.9183 1.3242 1.2455 1.3238 1.2668 1.2713 1.2779 1.3307 1.4173 1.3490 1.4933 1.3615 1.5701 1.4740 1.3247 1.2118 1.1835 1.2071 1.2174 1.2037 1.0846 1.0854 1.0723 1.0789 1.0563 1.0510 1.0531 1.0497 1.0494 1.0567 1.0527 1.0547 1.0742 9.2870 11.4215 11.8750 1.0804 1.0824 1.0359 1.0383 1.0360 1.0382 1.0668 1.0782 1.0592 1.0672 1.0626 1.0633 1.0869 1.0856 1.0865 1.0992 1.0992 1.1026 1.1010 1.0992 1.0994 1.0983 1.0998 1.0955 1.0996 1.0997 1.1005 1.0978 1.0649 1.0652
irintensity: 0.2153 0.3264 1.8954 1.2943 1.7907 2.3236 1.5008 0.5572 0.7125 6.0941 4.3812 0.7352 1.7429 2.4287 1.6492 3.9865 3.0677 3.7465 0.2562 3.4199 0.7341 6.6333 3.2989 0.2483 0.3193 6.9790 14.9470 1.1773 4.3579 2.4621 23.2530 3.0446 0.8564 7.1170 0.8624 3.3839 4.4997 7.0416 8.0606 45.6712 41.5920 4.2880 0.5249 1.4195 2.5107 0.6394 22.7567 32.9097 130.5175 111.6876 21.4926 3.0817 14.7513 1.2019 15.5261 21.6123 1.6097 8.7201 0.8550 4.8447 7.6276 19.6548 16.5530 76.0205 3.3830 45.0847 5.3409 9.0682 79.9539 0.8785 17.1275 63.7677 14.6574 0.6036 5.8581 159.0158 33.0183 39.4851 15.9943 127.0690 192.2999 133.2866 0.7809 39.8608 13.2285 1.9174 18.8870 43.9859 6.0168 31.4236 3.2346 19.5679 19.9101 49.4110 15.7214 29.6119 15.7193 32.4144 4.0555 5.3969 3.7283 3.4180 3.7689 17.1544 4.7692 41.1469 1.6746 2.4368 14.3292 21.2682 29.0287 18.7717 1.7908 7.4583 17.5403 18.6335 53.3822 20.4170 11.8209 19.5458 6.5638 6.5499 5.2089 4.9598 18.9328 22.2018 6.3787 8.6753 6.0518 17.9627 17.9097 26.5245 155.5876 302.5625 165.6983 7.6454 3.7085 27.2479 23.9335 13.1072 9.5028 38.9165 38.8194 42.1056 9.5535 3.1305 12.3581 6.2669 28.0764 15.4335 3.0193 41.6038 23.1222 56.4873 16.0775 32.9684 12.7632 50.0873 12.4913 13.9378 16.7196 30.7151 39.2554 55.4760 56.2586
temp: 298.150 k
press: 1.00000 atm
elementType: 8 8 8 8 8 8 8 6 6 6 6 6 6 6 6 6 6 6 6 6 6 6 6 6 6 6 6 1 1 1 1 1 1 1 1 1 1 1 1 1 1 1 1 1 1 1 1 1 1 1 1 1 1 1 1 1 1
symmnumber: 1
zpe: 1246165.4 jmol-1
zpe.correction: 0.474639 hartree
zpe.thermalcorrener: 0.502739 hartree
zpe.thermalcorrenthalpy: 0.503683 hartree
zpe.thermalcorrgfe: 0.415234 hartree
zpe.sumelectzpe: -1304.590203 hartree
zpe.sumelectthermal: -1304.562103 hartree
zpe.sumelectthermalent: -1304.561159 hartree
zpe.sumelectthermalfe: -1304.649608 hartree
dipole: -4.9092 -1.5247 -0.0393
dipole: 5.1407
quadrupole: -188.3146 -180.5157 -155.9817
quadrupole: 13.5026 -10.7249 -1.4613
quadrupole: -13.3773 -5.5783 18.9556 13.5026 -10.7249 -1.4613
hfenergy: -1305.0648422 hartree
pointgroup: C01 [X(C20H30O7)]
dipole: -1.9153162 -0.6301371 -0.1581895 debye
polarizability: 284.2077473|7.5609977|214.8091265|12.0683161|5.1967141|193.0916858 unknown
InChI: InChI=1S/C20H30O7/c1-5-10(2)17(23)26-14-7-15(22)19(4)8-12-13(6-11(3)16(14)19)27-18(24)20(12,25)9-21/h10-14,16,21,25H,5-9H2,1-4H3
charge 0 multiplicity 1
57 atoms
O  3.125271 -2.302078 0.289455
O  -2.812302 -0.422315 0.071257
O  4.539511 0.553045 -0.250928
O  0.083612 3.293642 0.57743
O  5.209066 -2.072222 1.281494
O  5.727205 0.593959 2.215398
O  -4.648966 0.521115 -1.013809
C  0.410485 1.250281 -0.817335
C  -0.466823 -0.038292 -0.618746
C  2.264246 -0.001017 0.582414
C  1.898505 1.150582 -0.383944
C  -0.089723 -1.236638 -1.531711
C  1.894891 -1.448995 0.078857
C  -1.918405 0.50074 -0.692301
C  1.432977 -1.57375 -1.379488
C  -0.395194 2.291733 -0.00234
C  3.791615 -0.055233 0.859411
C  -1.875652 1.892349 -0.016222
C  0.360893 1.774314 -2.292209
C  -0.94751 -2.49599 -1.254264
C  4.146751 -1.561495 0.858184
C  4.257363 0.597335 2.181436
C  -4.187037 -0.308374 -0.196119
C  -4.997375 -1.317378 0.608574
C  -6.110658 -0.586829 1.40991
C  -5.601746 -2.367427 -0.362878
C  -5.57045 0.391432 2.47423
H  -0.340358 -0.358617 0.438254
H  1.752728 0.160314 1.55328
H  2.170283 2.11083 0.096402
H  2.544869 1.070167 -1.271679
H  -0.262536 -0.941059 -2.586363
H  1.149966 -1.918156 0.746239
H  -2.303721 0.560645 -1.725752
H  1.606343 -2.614865 -1.707585
H  2.054948 -0.925947 -2.021389
H  -2.234905 1.824862 1.028203
H  -2.499715 2.64946 -0.520971
H  -0.66749 1.966292 -2.6484
H  0.927445 2.719251 -2.365959
H  0.828343 1.044356 -2.976118
H  -0.819063 -2.855576 -0.215811
H  -2.02253 -2.298947 -1.398588
H  -0.651234 -3.31423 -1.935939
H  3.827667 0.070413 3.057257
H  3.961837 1.659302 2.208554
H  5.437582 0.778421 0.128093
H  6.020279 -0.362431 2.210608
H  -4.307866 -1.821023 1.310802
H  -6.759791 -0.046452 0.694405
H  -6.736855 -1.359212 1.897522
H  -4.815089 -2.915313 -0.913011
H  -6.197063 -3.10415 0.20527
H  -6.26306 -1.876608 -1.09863
H  -4.914547 -0.125338 3.199516
H  -6.399812 0.854385 3.038521
H  -4.989102 1.210631 2.01101
