program: Gaussian 09
title: 000216272
version: EM64L-G09RevD.01
frameworkgroup: C1[X(C17H21NO3)]
method: RPBEPBE
basis: SDD
operation: Freq
keyword: #p
keyword: freq=noraman
keyword: PBEPBE/SDD
title: #p freq=noraman PBEPBE/SDD
converged: NO YES NO NO
title: Mulliken charges:
elementType: O O O N C C C C C C C C C C C C C C C C C H H H H H H H H H H H H H H H H H H H H H
charge: -0.227226 -0.304813 -0.297341 -0.106066 0.187479 -0.109892 -0.523445 -0.406993 -0.598207 0.473263 -0.240122 0.206543 -0.649448 -0.330303 -0.578326 -0.416922 0.206542 -0.351905 0.177592 -0.530965 -0.530013 0.232361 0.247796 0.238715 0.183235 0.233519 0.245835 0.243580 0.245983 0.240835 0.230290 0.186208 0.243576 0.260876 0.250322 0.250991 0.222059 0.230843 0.255375 0.231023 0.253473 0.223674
chargesum: 0.00000
title: Mulliken charges with hydrogens summed into heavy atoms:
elementType: O O O N C C C C C C C C C C C C C C C C C
charge: -0.227226 -0.304813 -0.297341 -0.106066 0.187479 0.122468 -0.036933 0.009761 -0.108792 0.473263 0.005862 0.206543 0.007884 -0.086727 -0.317450 -0.166600 0.206542 -0.100914 0.177592 0.177313 0.178157
polarizability: 2.60991008e+02 -1.04436911e+01 1.88933406e+02 -4.67421257e+00 9.27174089e-01 1.47169065e+02
1716.lowfreq: -9.8141 -0.0004 0.0002 0.0005 4.1541 9.1357 26.5320 32.5351 46.8795
frequency: 26.1362 32.4366 46.8772 67.2259 90.5834 109.8599 117.6680 126.8854 144.7506 162.6482 164.9405 177.4732 201.1670 222.0222 232.3972 263.2391 277.4429 287.0310 300.9091 320.3364 351.6886 366.5018 399.1118 408.2698 442.5286 469.6078 480.8149 496.8068 559.3596 573.9984 576.9677 599.4002 632.9507 659.5333 681.0868 711.1486 739.0527 748.1346 758.7759 776.9649 828.4063 839.8316 840.2709 891.5431 909.9759 925.5819 942.8242 949.0647 959.2084 979.7302 989.8364 998.9961 1010.1424 1023.4067 1048.8364 1066.0218 1088.7667 1110.6339 1114.3432 1115.5700 1116.2427 1136.6350 1146.1092 1153.7227 1154.7757 1172.5855 1186.2826 1206.2603 1211.0947 1223.1280 1245.0159 1245.5522 1259.9545 1261.7987 1283.3428 1305.4765 1313.0968 1340.8434 1354.6530 1359.6090 1380.0934 1396.9153 1423.7616 1427.4542 1440.7222 1443.3453 1457.5053 1459.4837 1468.7985 1474.8826 1475.9116 1477.2293 1481.6716 1488.2127 1488.3066 1567.1783 1594.3313 1609.8072 1636.0011 2820.1393 2831.5790 2855.8307 2971.9513 2973.7908 2984.1779 3017.5444 3033.4845 3040.8713 3066.0412 3068.3958 3070.5309 3084.0898 3087.6862 3087.8824 3121.9983 3122.4433 3137.0702 3139.6760 3144.1357 3162.2863
redmass: 4.4637 5.2501 3.5948 4.8485 3.5635 2.9805 2.9761 3.2704 2.5506 1.1750 1.1003 3.3724 1.2469 2.9273 3.7248 4.1453 3.8512 3.9207 2.3709 3.5804 4.4421 2.8004 4.2098 3.6674 4.2853 3.8563 3.6818 3.5459 4.9233 5.1682 3.6671 4.7818 3.3373 4.0616 3.6599 5.8148 4.9712 3.4003 2.5724 1.9667 2.4745 1.5333 2.0322 1.6554 2.4286 4.0513 3.7638 3.6683 1.4854 3.3908 2.1292 2.3579 1.4311 2.5703 1.9778 2.0822 2.5368 1.4120 1.2459 1.2614 1.6152 1.6610 1.6176 1.3301 1.4174 1.2542 1.8294 1.6696 2.3773 1.9217 2.6498 1.8390 1.9332 1.9088 1.8892 1.3567 1.4989 1.4763 2.9951 1.9733 1.8705 2.9036 1.1779 1.1372 1.3189 1.1091 1.0527 1.0744 1.0579 1.1116 1.0661 1.0747 2.2060 1.1228 1.0534 7.4888 9.6027 6.7553 7.5256 1.0783 1.0729 1.0588 1.0308 1.0311 1.0655 1.0640 1.0726 1.0859 1.0946 1.1040 1.1037 1.1008 1.0902 1.0999 1.1027 1.1029 1.0884 1.0908 1.0961 1.0959
irintensity: 0.3934 1.4971 0.1924 1.4911 7.4500 6.7846 1.6353 0.5303 3.0816 0.0048 0.0258 1.8345 0.9479 8.6593 6.8812 2.9451 0.6416 3.6769 1.3377 5.3111 1.6724 4.9472 2.5119 4.2179 13.1834 1.2685 3.4783 8.9024 2.9992 5.0538 4.0117 1.7979 4.4629 8.7740 4.7962 9.0331 1.0122 6.5206 1.4752 31.1805 7.4771 27.3209 8.6507 6.3282 22.7867 10.2684 78.5808 26.3614 7.9940 42.1348 4.1050 12.2260 1.9001 8.0940 9.3183 23.0248 35.3251 19.5502 16.0319 1.3193 0.1383 10.2382 6.9789 0.5088 1.9956 8.3250 36.2763 40.4604 7.4096 31.8513 120.1568 23.2441 25.1548 28.0238 6.6653 8.2889 10.1197 7.7058 18.1414 7.5608 15.2440 10.8492 2.2337 7.7567 13.3549 12.5627 16.8343 11.8613 19.8538 14.5040 38.7234 8.9831 129.1671 22.6795 28.5191 6.4817 145.9260 11.3380 108.4836 42.9456 91.8927 176.6579 88.8935 58.6542 11.0335 14.6299 34.9358 51.7366 18.5290 30.7267 22.8071 29.2206 13.3921 21.0244 23.8860 23.7744 5.5930 6.6605 12.9957 5.8511
temp: 298.150 k
press: 1.00000 atm
elementType: 8 8 8 7 6 6 6 6 6 6 6 6 6 6 6 6 6 6 6 6 6 1 1 1 1 1 1 1 1 1 1 1 1 1 1 1 1 1 1 1 1 1
symmnumber: 1
zpe: 903940.9 jmol-1
zpe.correction: 0.344293 hartree
zpe.thermalcorrener: 0.364739 hartree
zpe.thermalcorrenthalpy: 0.365683 hartree
zpe.thermalcorrgfe: 0.294824 hartree
zpe.sumelectzpe: -939.192746 hartree
zpe.sumelectthermal: -939.172300 hartree
zpe.sumelectthermalent: -939.171356 hartree
zpe.sumelectthermalfe: -939.242214 hartree
dipole: -4.2559 2.7839 1.4813
dipole: 5.2969
quadrupole: -135.9106 -122.4310 -121.5846
quadrupole: 11.1374 6.9680 -9.5174
quadrupole: -9.2686 4.2111 5.0575 11.1374 6.9680 -9.5174
hfenergy: -939.5370386 hartree
pointgroup: C01 [X(C17H21N1O3)]
dipole: -1.6678628 1.1606708 0.4625108 debye
polarizability: 260.8270518|-10.7579012|188.1339899|-6.4841128|-5.0253629|148.1324372 unknown
InChI: InChI=1S/C17H21NO3/c1-18-9-8-17(7-6-13(19)11-16(17)18)12-4-5-14(20-2)15(10-12)21-3/h4-7,10,16H,8-9,11H2,1-3H3
charge 0 multiplicity 1
42 atoms
O  4.431231 -2.17937 -1.185887
O  -3.401666 1.56133 -0.365407
O  -4.349749 -1.215626 -0.265202
N  2.96571 1.468823 -0.326461
C  1.252097 0.07019 0.618032
C  1.934492 0.4846 -0.744491
C  1.477761 1.350161 1.529934
C  2.273245 2.342919 0.65007
C  2.507764 -0.704522 -1.533023
C  -0.236301 -0.270246 0.403822
C  1.991748 -1.085609 1.277274
C  3.41867 -1.59776 -0.694046
C  3.634139 2.198111 -1.415614
C  3.001546 -1.806245 0.711213
C  -1.171264 0.760306 0.125122
C  -0.702164 -1.609255 0.408469
C  -2.529624 0.475199 -0.112968
C  -2.067357 -1.903381 0.195121
C  -2.995524 -0.871129 -0.046021
C  -4.051855 1.534692 -1.697382
C  -5.297292 -0.659862 0.730366
H  1.155077 0.981497 -1.380456
H  2.072341 1.072925 2.417363
H  0.524205 1.773283 1.885504
H  1.575778 3.057296 0.13775
H  3.00449 2.938833 1.224549
H  3.056567 -0.379462 -2.43353
H  1.659949 -1.328784 -1.883769
H  1.691797 -1.299166 2.314257
H  4.206659 1.503021 -2.052413
H  4.35184 2.918168 -0.984609
H  2.919965 2.766689 -2.065022
H  3.552271 -2.566847 1.277611
H  -0.863882 1.810723 0.07339
H  0.000488 -2.428813 0.593089
H  -2.437155 -2.933479 0.221827
H  -3.288616 1.631687 -2.49268
H  -4.722417 2.407231 -1.712816
H  -4.624497 0.600846 -1.840771
H  -6.294803 -0.98329 0.396408
H  -5.236415 0.442881 0.763712
H  -5.081352 -1.077368 1.731987
