program: Gaussian 09
title: 000210877
version: EM64L-G09RevD.01
frameworkgroup: C1[X(C16H20N2O2)]
method: RPBEPBE
basis: SDD
operation: Freq
keyword: #p
keyword: freq=noraman
keyword: PBEPBE/SDD
title: #p freq=noraman PBEPBE/SDD
converged: YES YES NO NO
title: Mulliken charges:
elementType: O O N N C C C C C C C C C C C C C C C C H H H H H H H H H H H H H H H H H H H H
charge: -0.255740 -0.230719 -0.082003 -0.409651 -0.341879 -0.426283 -0.404014 -0.022390 -0.396450 -0.518568 0.321803 -0.401224 -0.399229 0.317350 0.228936 -0.375731 -0.384629 -0.241917 -0.247027 -0.244395 0.215251 0.198714 0.215842 0.227955 0.191500 0.213721 0.233246 0.226096 0.195262 0.213982 0.222931 0.234674 0.233484 0.214882 0.334637 0.226081 0.240789 0.223647 0.222903 0.228165
chargesum: 0.00000
title: Mulliken charges with hydrogens summed into heavy atoms:
elementType: O O N N C C C C C C C C C C C C C C C C
charge: -0.255740 -0.230719 -0.082003 -0.075013 0.072086 0.017514 0.001208 0.210856 0.024907 -0.081655 0.321803 0.066934 -0.184347 0.317350 0.228936 -0.149650 -0.143840 -0.018271 -0.024124 -0.016231
polarizability: 2.89054227e+02 -1.16091053e+01 1.69231070e+02 7.86077635e+00 -5.67562994e+00 1.26994442e+02
1716.lowfreq: -7.6702 -4.7646 -0.0003 0.0005 0.0007 7.2672 21.5960 23.8268 35.4452
frequency: 21.2377 23.7932 35.2703 54.8381 67.7831 79.3959 114.0547 130.8756 153.8261 171.4449 190.5822 228.2799 247.0593 263.5179 324.9115 340.7374 359.4848 395.0639 404.2116 441.8929 477.3793 492.9167 507.8928 519.3779 542.7781 564.2268 616.5331 625.1939 681.6036 689.9322 694.8317 697.6393 750.3349 755.8990 780.6141 802.0967 825.5781 829.9420 847.8153 870.5670 913.2339 937.0790 950.3076 964.1843 972.9159 974.8226 988.4775 989.6606 992.9929 1019.8177 1032.1345 1047.7055 1051.1386 1061.8903 1079.9867 1086.5581 1094.7582 1117.9630 1139.1835 1165.0741 1172.9307 1184.3496 1189.0020 1197.3214 1199.2418 1218.2604 1229.8747 1256.2963 1264.5876 1283.0222 1301.4709 1305.3169 1312.1126 1320.0019 1329.3219 1339.0989 1359.4070 1363.8031 1374.8065 1380.1081 1397.9565 1401.7370 1436.7208 1446.6508 1451.6997 1460.5160 1468.9900 1484.0770 1488.2199 1499.1159 1581.7684 1611.7444 1668.0095 1734.6118 2792.5524 2852.8997 2879.2684 2965.3600 2972.8824 2983.3101 2988.5153 2996.2251 3005.7019 3026.8641 3030.6047 3050.6543 3058.2915 3119.9629 3122.0095 3127.9247 3141.7228 3149.3652 3164.1487 3618.7990
redmass: 5.9047 4.6279 4.3121 3.5642 5.0275 5.1451 4.0616 3.0466 3.2295 3.4231 3.6849 2.1116 2.9936 3.3492 4.7859 2.1584 3.8959 3.2006 2.8228 3.0025 3.5054 3.1599 1.1899 2.9210 4.0234 3.4483 6.3465 4.6528 5.0841 12.1613 4.8229 1.7979 3.8752 1.6801 1.6447 2.0962 1.4224 2.5296 1.2568 5.3169 1.5192 3.1616 2.1849 2.1695 1.4434 2.3927 4.0072 1.9943 1.4781 2.3498 2.0674 2.3618 2.0495 3.0466 2.1516 1.6806 2.4109 1.9516 2.4369 1.6033 1.0529 2.0141 1.5859 1.1297 1.4534 1.3387 1.3501 1.2871 2.5725 1.3044 1.3502 1.2087 1.3614 1.3813 1.4585 1.3697 1.5139 1.9839 1.5460 5.3462 1.6645 1.4630 2.3306 1.0859 1.1013 1.0841 1.0870 1.0968 2.2609 1.0872 5.6937 5.9615 6.8699 10.0654 1.0716 1.0711 1.0688 1.0662 1.0605 1.0736 1.0711 1.0836 1.0896 1.0921 1.0961 1.1006 1.1003 1.0876 1.0867 1.0871 1.0919 1.0957 1.1014 1.0796
irintensity: 4.1731 1.8939 1.6029 1.5313 4.2145 0.8595 0.4457 0.5266 0.6008 1.6730 2.9656 5.1758 0.7354 0.7778 0.0283 6.1613 2.6407 1.8355 0.0045 3.9747 7.4201 13.4200 144.0881 4.9292 1.9803 1.5265 0.0247 4.0569 0.3472 26.4370 11.2275 39.3386 17.0790 58.5281 4.9399 12.4905 8.6539 8.0591 0.1583 152.7614 4.3330 1.2027 11.8265 22.1735 2.6719 4.6034 0.5203 3.6238 2.3605 1.6718 5.6030 28.9006 15.7713 132.7116 1.1200 8.7246 1.2293 26.2978 47.9663 12.0043 0.1399 90.8574 41.9095 0.5262 18.2478 1.4438 11.2452 0.3412 0.9352 13.5354 12.6103 13.4858 9.5328 2.8482 9.0892 14.4664 0.7223 11.7011 55.3935 1.0354 3.1841 5.0358 7.5541 3.2643 6.1431 13.3053 1.2836 17.0706 18.5584 11.9031 2.3690 16.6507 8.8953 575.1096 72.9819 75.5083 96.9808 46.1894 27.7186 12.6638 38.4057 32.7991 16.0207 35.9422 44.2649 1.3646 80.9693 20.6245 5.0345 1.1551 20.0093 46.7736 22.4334 48.6284
temp: 298.150 k
press: 1.00000 atm
elementType: 8 8 7 7 6 6 6 6 6 6 6 6 6 6 6 6 6 6 6 6 1 1 1 1 1 1 1 1 1 1 1 1 1 1 1 1 1 1 1 1
symmnumber: 1
zpe: 873037.7 jmol-1
zpe.correction: 0.332523 hartree
zpe.thermalcorrener: 0.350747 hartree
zpe.thermalcorrenthalpy: 0.351691 hartree
zpe.thermalcorrgfe: 0.283548 hartree
zpe.sumelectzpe: -880.150791 hartree
zpe.sumelectthermal: -880.132566 hartree
zpe.sumelectthermalent: -880.131622 hartree
zpe.sumelectthermalfe: -880.199766 hartree
dipole: 1.0251 -2.4447 4.2376
dipole: 4.9985
quadrupole: -126.3704 -112.2560 -123.2649
quadrupole: 14.2889 -29.8692 4.9835
quadrupole: -5.7400 8.3744 -2.6345 14.2889 -29.8692 4.9835
hfenergy: -880.4833137 hartree
pointgroup: C01[X(C16H20N2O2)]
dipole: 0.4053864 -0.9303242 1.6844966 debye
polarizability: 289.0275542|-11.8482508|169.0661663|7.5878511|-6.4864996|127.1860186 unknown
InChI: InChI=1S/C16H20N2O2/c19-16-17-12-15(20-16)8-11-18-9-6-14(7-10-18)13-4-2-1-3-5-13/h1-6,15,17H,7-12H2
charge 0 multiplicity 1
40 atoms
O  -4.751252 0.161179 -0.713812
O  -6.751181 1.289879 -1.23925
N  -0.461395 -0.731845 -0.111744
N  -6.383334 0.248208 0.865808
C  -1.89767 -0.869643 -0.450351
C  -2.817002 -0.436188 0.71063
C  0.420956 -1.452945 -1.061782
C  -4.292386 -0.708207 0.422776
C  -0.044962 0.682778 0.036841
C  1.86068 -1.512325 -0.519497
C  2.364553 -0.127846 -0.122143
C  -5.263801 -0.360832 1.592633
C  1.453924 0.860568 0.116916
C  3.834861 0.087518 0.004087
C  -6.065287 0.640158 -0.431013
C  4.419743 1.383627 -0.095748
C  4.708805 -1.015153 0.223504
C  5.810054 1.57032 0.039853
C  6.10198 -0.83044 0.359889
C  6.662143 0.463789 0.271958
H  -2.175401 -0.292142 -1.367211
H  -2.086873 -1.939061 -0.669991
H  -2.519292 -0.991199 1.622934
H  -2.702026 0.642958 0.92429
H  0.427289 -0.967672 -2.071749
H  0.026116 -2.477771 -1.191402
H  -4.447397 -1.75323 0.089761
H  -0.498957 1.098459 0.958407
H  -0.437028 1.312662 -0.809865
H  2.52227 -1.950677 -1.292208
H  1.888487 -2.191387 0.356155
H  -5.567052 -1.267372 2.144341
H  -4.79563 0.349165 2.304761
H  1.786246 1.861211 0.421579
H  -7.255665 0.546191 1.296033
H  3.782865 2.249647 -0.308549
H  4.296213 -2.026458 0.305159
H  6.233161 2.577615 -0.048326
H  6.749535 -1.697034 0.535887
H  7.743413 0.608795 0.372938
