program: Gaussian 09
title: 000210876
version: EM64L-G09RevD.01
frameworkgroup: C1[X(C18H20N2O)]
method: RPBEPBE
basis: SDD
operation: Freq
keyword: #p
keyword: freq=noraman
keyword: PBEPBE/SDD
title: #p freq=noraman PBEPBE/SDD
converged: YES YES NO NO
title: Mulliken charges:
elementType: O N N C C C C C C C C C C C C C C C C C C H H H H H H H H H H H H H H H H H H H H
charge: -0.264547 -0.064707 -0.276326 -0.110241 -0.493068 -0.409179 -0.379641 -0.630865 0.370080 0.087981 0.264867 -0.327058 -0.386935 -0.219093 -0.224265 -0.321425 -0.373387 -0.239363 -0.239764 -0.228756 -0.231807 0.296393 0.245083 0.237275 0.187982 0.267515 0.227321 0.184002 0.223356 0.230716 0.184860 0.251326 0.268340 0.230349 0.231511 0.247196 0.266085 0.232202 0.227556 0.229231 0.229201
chargesum: 0.00000
title: Mulliken charges with hydrogens summed into heavy atoms:
elementType: O N N C C C C C C C C C C C C C C C C C C
charge: -0.264547 -0.064707 -0.276326 0.186152 -0.010710 0.046317 0.031682 0.008067 0.370080 0.087981 0.264867 -0.075732 -0.118596 0.011256 0.007246 -0.074229 -0.107302 -0.007161 -0.012208 0.000475 -0.002606
polarizability: 2.35565316e+02 -5.51093134e+00 2.11163452e+02 -1.16375723e+01 -1.65622107e+01 1.63744681e+02
1716.lowfreq: -12.2719 -7.3388 -3.5092 0.0002 0.0007 0.0011 10.4897 24.3256 37.3422
frequency: -4.4332 24.1277 37.2011 43.1177 66.8716 74.0802 100.2097 112.5829 141.5015 173.8460 192.3092 240.2887 251.7286 261.0447 265.5318 303.1075 345.8828 366.3749 401.9976 407.5461 416.8252 459.8117 478.0131 512.7364 528.0432 584.0473 613.4473 615.8319 632.4029 657.2151 694.3981 703.0284 706.4449 718.8051 771.6850 787.8912 812.7401 833.0110 852.1707 853.1986 859.3369 922.5109 928.7982 933.3278 970.9599 978.5874 980.1028 982.1904 989.5913 990.8169 996.4117 999.2711 1012.7113 1025.0352 1030.7498 1058.3699 1076.5677 1084.1387 1084.7783 1093.2092 1113.4040 1132.3733 1163.2031 1171.8134 1172.7596 1175.9440 1180.3379 1188.8006 1202.5117 1223.1033 1242.6438 1254.3043 1283.8426 1295.7686 1299.4636 1310.4953 1316.4637 1329.6424 1345.7933 1372.3389 1378.4821 1382.0422 1432.5240 1432.7105 1435.8343 1466.2218 1472.5969 1476.9428 1479.4040 1480.1818 1480.9782 1495.8096 1542.7852 1587.6407 1591.1175 1605.9493 1609.6594 2829.8062 2841.9338 2856.8489 3017.6694 3021.4338 3033.6933 3057.8487 3071.3343 3075.1887 3097.9614 3126.4170 3126.9901 3133.2300 3138.5338 3145.6387 3152.6138 3153.2639 3164.7088 3167.9564 3174.9199
redmass: 2.4305 3.6893 3.9368 5.2050 3.9367 4.2356 4.4649 3.6760 2.6626 4.6845 4.3605 1.0632 4.0000 5.0632 3.8759 2.4165 3.7539 4.5350 3.6886 3.3629 2.9537 2.9370 6.2513 3.8038 3.5523 4.0337 6.3019 6.3335 5.0486 5.8764 5.0887 1.5821 2.1815 3.1659 1.8005 2.2628 1.8247 5.0219 1.3238 1.3232 2.0341 2.5051 1.4854 1.4805 1.4691 1.8390 1.4216 1.6487 5.7245 5.6271 1.3154 1.3414 3.6578 2.1444 2.1761 2.1137 1.5634 1.5914 1.8933 2.4642 1.4974 3.1006 1.8192 1.0550 1.0536 1.4513 1.1285 1.1195 1.6119 2.0187 2.5306 1.5570 1.4213 1.9617 1.5611 1.4371 1.3204 1.9055 1.4665 6.1279 1.7253 5.6204 1.2902 1.8969 2.2248 1.0530 1.0779 1.0991 2.2552 2.0403 1.1300 1.1032 10.3407 6.3103 6.4086 6.2397 6.0772 1.0693 1.0647 1.0649 1.0720 1.0790 1.0698 1.0878 1.0895 1.1008 1.1011 1.0850 1.0850 1.0880 1.0890 1.0926 1.0939 1.0967 1.0969 1.1016 1.0975
irintensity: 0.3744 0.1605 0.1848 1.0347 0.4548 1.1705 1.6566 0.3374 1.0831 2.1601 1.9516 0.7925 0.4081 0.4939 2.1867 11.1372 3.5196 7.4350 1.6129 1.6674 0.0877 0.6890 9.9251 4.2556 2.2055 3.6359 0.3499 2.7318 45.8822 2.5909 2.8629 84.9338 44.4367 36.2623 16.9803 31.3624 3.7891 2.6132 2.7098 4.0744 9.6454 7.3644 3.6067 6.9858 0.1163 0.5021 2.0248 0.5430 1.4329 0.5996 0.3323 0.7651 1.3969 7.7420 13.8025 6.9504 9.7628 15.1488 13.3416 14.6389 12.1960 19.3073 56.3480 0.0400 0.1523 1.9242 0.8126 10.3046 5.5015 14.6572 4.5027 37.5937 58.2864 163.7194 94.9900 24.8496 1.0830 67.3934 9.2799 0.6397 25.1367 2.9671 3.7644 6.1723 4.9287 29.5457 7.1824 1.1696 20.9776 42.6754 11.5426 6.1844 219.5811 3.3674 17.1847 2.3875 4.1962 82.9038 46.8624 208.2956 49.6945 30.4407 50.2622 11.1181 0.8803 29.9019 30.0371 0.0602 2.5033 1.8297 10.8500 18.9179 21.8516 23.4381 26.0943 13.9582 7.3882
temp: 298.150 k
press: 1.00000 atm
elementType: 8 7 7 6 6 6 6 6 6 6 6 6 6 6 6 6 6 6 6 6 6 1 1 1 1 1 1 1 1 1 1 1 1 1 1 1 1 1 1 1 1
symmnumber: 1
zpe: 888540.9 jmol-1
zpe.correction: 0.338427 hartree
zpe.thermalcorrener: 0.356368 hartree
zpe.thermalcorrenthalpy: 0.357312 hartree
zpe.thermalcorrgfe: 0.291097 hartree
zpe.sumelectzpe: -881.108112 hartree
zpe.sumelectthermal: -881.090172 hartree
zpe.sumelectthermalent: -881.089228 hartree
zpe.sumelectthermalfe: -881.155442 hartree
dipole: -0.3700 4.6635 0.8654
dipole: 4.7575
quadrupole: -113.5153 -128.0813 -116.1707
quadrupole: 0.5300 -1.2248 -6.8059
quadrupole: 5.7405 -8.8256 3.0851 0.5300 -1.2248 -6.8059
hfenergy: -881.4465394 hartree
pointgroup: C01 [X(C18H20N2O1)]
dipole: -0.1078002 -1.7490437 0.6577603 debye
polarizability: 233.7211758|14.1588237|184.6052349|10.2909573|-27.7096136|192.1470378 unknown
InChI: InChI=1S/C18H20N2O/c1-19-13-12-17(14-19)20(16-10-6-3-7-11-16)18(21)15-8-4-2-5-9-15/h2-11,17H,12-14H2,1H3
charge 0 multiplicity 1
41 atoms
O  -0.14467 2.323253 -1.1248
N  4.034465 0.942266 -0.490621
N  0.416727 0.528095 0.258353
C  1.816722 1.065562 0.27186
C  2.698442 0.688437 1.503089
C  2.667771 0.617022 -0.945678
C  4.121608 0.459305 0.912451
C  5.123185 0.499794 -1.369061
C  0.180176 -0.861983 0.595311
C  -0.512362 1.285041 -0.485269
C  -1.962917 0.873987 -0.493948
C  0.021199 -1.820812 -0.436728
C  0.11934 -1.278526 1.94878
C  -0.203082 -3.178085 -0.117538
C  -0.090618 -2.638555 2.265031
C  -2.644853 0.373078 0.644653
C  -2.692882 1.112168 -1.687741
C  -0.252772 -3.592963 1.233438
C  -4.028261 0.097648 0.581415
C  -4.070707 0.819051 -1.755748
C  -4.743088 0.307628 -0.620423
H  1.70823 2.159463 0.208283
H  2.346385 -0.231927 1.993898
H  2.68261 1.499605 2.249921
H  2.524764 -0.480087 -1.133776
H  2.403425 1.173545 -1.860191
H  4.908823 1.009155 1.459271
H  4.378221 -0.630372 0.954142
H  6.092318 0.849244 -0.968765
H  4.995315 0.937606 -2.375005
H  5.177611 -0.614479 -1.478363
H  0.060823 -1.494656 -1.481859
H  0.207482 -0.53047 2.744298
H  -0.335547 -3.909688 -0.922212
H  -0.138577 -2.949927 3.314402
H  -2.105939 0.21648 1.582913
H  -2.166283 1.544368 -2.544843
H  -0.421845 -4.646838 1.479966
H  -4.547498 -0.278065 1.470031
H  -4.621176 0.997292 -2.686082
H  -5.815166 0.085641 -0.668759
