program: Gaussian 09
title: 000210874
version: EM64L-G09RevD.01
frameworkgroup: C1[X(C14H16ClNO4)]
method: RPBEPBE
basis: SDD
operation: Freq
keyword: #p
keyword: freq=noraman
keyword: PBEPBE/SDD
title: #p freq=noraman PBEPBE/SDD
converged: YES YES NO NO
title: Mulliken charges:
elementType: Cl O O O O N C C C C C C C C C C C C C C H H H H H H H H H H H H H H H H
charge: -0.041158 -0.243707 -0.391959 -0.258311 -0.213471 -0.112612 -0.120752 -0.348785 -0.348955 -0.575146 -0.333209 -0.315364 0.180547 0.088406 0.318707 -0.341504 -0.338233 -0.233804 -0.219235 -0.104379 0.279189 0.252341 0.204520 0.199415 0.222704 0.252929 0.254084 0.195800 0.219262 0.219216 0.196523 0.381503 0.269187 0.283289 0.261777 0.261184
chargesum: 0.00000
title: Mulliken charges with hydrogens summed into heavy atoms:
elementType: Cl O O O O N C C C C C C C C C C C C C C
charge: -0.041158 -0.243707 -0.010456 -0.258311 -0.213471 -0.112612 0.158438 0.108075 0.073165 -0.068133 0.081852 0.100375 0.180547 0.088406 0.318707 -0.072317 -0.054943 0.027973 0.041949 -0.104379
polarizability: 2.88021138e+02 -1.60444860e+01 1.70167774e+02 1.03868413e+00 1.23442584e+01 1.18287524e+02
1716.lowfreq: -8.8303 -0.0012 -0.0009 -0.0004 3.6343 10.6641 20.1756 28.0037 47.0583
frequency: 18.8041 27.9776 46.9859 50.4298 66.8217 70.0227 83.8195 113.3809 143.7295 170.3894 187.3528 209.5106 242.9296 254.6163 298.8123 313.9183 319.1893 335.5941 386.2920 398.4409 408.9514 437.9456 465.7868 467.4742 491.1214 517.0886 580.6425 598.9104 609.7523 621.9762 645.1683 689.6053 700.2074 729.8285 756.8001 794.4291 805.2158 818.8340 835.1651 844.6202 854.4343 906.9834 964.0147 970.4582 983.3281 991.1873 997.2756 1003.4988 1025.3143 1035.1821 1054.3832 1072.5919 1073.1623 1082.3657 1093.7522 1112.7431 1129.9896 1145.4980 1165.2722 1191.0089 1194.4649 1233.5702 1251.0712 1264.7892 1275.9891 1289.8712 1299.2104 1301.2417 1325.7096 1339.5513 1349.6915 1368.1132 1369.9085 1371.2881 1393.0739 1399.3877 1444.6945 1451.8968 1454.6595 1457.1969 1466.2887 1481.1981 1547.7491 1583.9182 1596.3402 1641.4637 2885.8728 2896.0220 2960.2238 2962.9944 3015.5414 3039.5233 3052.0432 3056.7103 3084.2250 3087.1034 3098.8272 3154.4719 3154.9263 3173.5102 3176.9125 3499.0994
redmass: 8.6071 6.1583 3.8000 6.3855 5.4176 5.0803 10.7018 8.6568 6.3754 6.2393 3.9869 4.9561 2.0196 6.5809 8.2098 3.8020 4.8644 3.5674 3.9352 2.3665 2.9588 3.6794 3.1971 3.2676 3.6512 5.3228 2.1080 3.8026 2.0711 6.5946 2.2775 4.6855 3.0341 3.9390 4.9631 3.9910 2.8712 2.8204 1.3627 1.6143 1.8618 2.2975 1.4569 2.7659 2.4960 1.8073 3.7797 2.8749 2.2255 2.8472 2.0101 2.6245 2.3674 3.8060 2.3355 1.3809 2.4685 2.6742 1.5282 1.1482 1.0657 1.2796 1.5046 1.4782 1.2689 2.3025 1.3591 1.2726 1.3012 1.2360 1.4582 1.3980 4.5207 1.3007 1.6140 3.9145 1.0830 1.0949 1.1012 1.2531 1.0960 1.8565 8.7213 7.0605 6.4834 8.2183 1.0695 1.0687 1.0662 1.0664 1.0622 1.0908 1.0914 1.0855 1.0968 1.0985 1.0986 1.0890 1.0888 1.0963 1.0975 1.0639
irintensity: 0.3985 0.2925 0.8872 0.7836 2.3203 1.2736 2.9337 1.4688 5.1439 0.3542 3.0903 8.7398 2.8714 1.7704 0.4303 6.4246 0.6146 18.2955 4.5633 3.3261 1.6747 2.0308 5.7540 12.2373 52.3054 13.2820 50.0881 17.5277 45.2709 0.2501 4.3835 13.5826 73.7137 18.7636 17.8797 3.9030 20.6845 15.3411 6.2270 1.6523 63.7441 10.4562 17.3658 131.7995 47.9106 11.4740 39.7506 59.0933 2.3221 54.1605 17.4990 89.7403 156.8651 63.0104 37.5402 15.7848 66.7544 3.8779 45.8316 16.5066 1.5279 11.2018 62.3235 17.4397 2.8972 254.4051 18.9542 7.8096 17.3651 7.0928 13.4600 1.8719 17.3788 0.6415 18.2347 19.5362 3.2647 10.0199 14.2590 26.7075 14.8508 20.9041 125.1921 53.9945 90.3641 167.6530 45.3927 72.9250 29.7677 113.2907 6.4545 28.8722 12.9112 3.1661 34.0694 32.9637 8.0095 0.4334 0.1768 2.6059 4.2873 27.1588
temp: 298.150 k
press: 1.00000 atm
elementType: 17 8 8 8 8 7 6 6 6 6 6 6 6 6 6 6 6 6 6 6 1 1 1 1 1 1 1 1 1 1 1 1 1 1 1 1
symmnumber: 1
zpe: 734873.9 jmol-1
zpe.correction: 0.279899 hartree
zpe.thermalcorrener: 0.298815 hartree
zpe.thermalcorrenthalpy: 0.299759 hartree
zpe.thermalcorrgfe: 0.229994 hartree
zpe.sumelectzpe: -1357.278122 hartree
zpe.sumelectthermal: -1357.259206 hartree
zpe.sumelectthermalent: -1357.258262 hartree
zpe.sumelectthermalfe: -1357.328027 hartree
dipole: -0.4971 -1.2068 0.6504
dipole: 1.4582
quadrupole: -136.2752 -125.4595 -122.3119
quadrupole: 1.6463 -4.9058 -2.9106
quadrupole: -8.2596 2.5560 5.7037 1.6463 -4.9058 -2.9106
hfenergy: -1357.5580209 hartree
pointgroup: C01[X(C14H16Cl1N1O4)]
dipole: 0.2077722 -0.0686936 -0.5303389 debye
polarizability: 287.4946784|4.461791|146.8137702|18.1146152|28.3870761|142.1679875 unknown
InChI: InChI=1S/C14H16ClNO4/c15-11-3-1-10(2-4-11)13(17)9-12(14(18)19)16-5-7-20-8-6-16/h1-4,12,18H,5-9H2
charge 0 multiplicity 1
36 atoms
Cl -6.43863 -0.783707 -0.772503
O  5.27265 -1.343565 0.538928
O  1.005447 1.612244 -2.26133
O  0.432445 -0.631566 -2.139117
O  -0.640463 1.709865 1.837994
N  2.79415 -0.033343 -0.157887
C  1.410244 0.496295 -0.153132
C  2.936454 -1.506607 -0.284326
C  3.660219 0.510286 0.917669
C  0.429856 -0.210722 0.851764
C  4.412174 -1.851744 -0.543276
C  5.123257 0.116759 0.643252
C  0.889971 0.399938 -1.589812
C  -0.795547 0.65164 1.150821
C  -2.15374 0.260574 0.649182
C  -2.362547 -0.763737 -0.315341
C  -3.27901 0.967258 1.160288
C  -3.665386 -1.080227 -0.75495
C  -4.584051 0.655022 0.738585
C  -4.756236 -0.370069 -0.216392
H  1.467332 1.564781 0.116244
H  2.315379 -1.866511 -1.123723
H  2.606453 -2.030835 0.644512
H  3.364156 0.125933 1.924311
H  3.5721 1.612239 0.932089
H  0.171427 -1.216354 0.485969
H  0.976413 -0.313879 1.808021
H  4.732574 -1.416396 -1.514009
H  4.567194 -2.943037 -0.554781
H  5.777093 0.423714 1.476012
H  5.463925 0.597336 -0.298806
H  0.703835 1.504582 -3.205135
H  -1.517038 -1.30033 -0.756839
H  -3.102296 1.761743 1.892398
H  -3.828424 -1.86018 -1.503866
H  -5.449678 1.191199 1.137689
