program: Gaussian 09
title: 000210870
version: EM64L-G09RevD.01
frameworkgroup: C1[X(C7H6N2O2S2)]
method: RPBEPBE
basis: SDD
operation: Freq
keyword: #p
keyword: freq=noraman
keyword: PBEPBE/SDD
title: #p freq=noraman PBEPBE/SDD
converged: YES YES NO NO
title: Mulliken charges:
elementType: S S O O N N C C C C C C C H H H H H H
charge: 0.091130 0.135730 -0.235056 -0.246190 -0.451043 -0.169932 0.354437 -0.441476 0.624820 0.077911 -0.660917 -0.637991 -0.079471 0.338607 0.293689 0.251343 0.228521 0.284821 0.241067
chargesum: 0.00000
title: Mulliken charges with hydrogens summed into heavy atoms:
elementType: S S O O N N C C C C C C C
charge: 0.091130 0.135730 -0.235056 -0.246190 -0.112435 -0.169932 0.354437 -0.441476 0.624820 0.077911 -0.367228 0.126694 0.161596
polarizability: 2.57015432e+02 -9.59825757e+00 1.34763318e+02 5.47257568e-01 7.87701009e-01 5.46109392e+01
1716.lowfreq: -6.7912 -4.5946 -0.0013 0.0011 0.0019 3.5274 45.2140 75.5546 112.4149
frequency: 45.1975 75.5425 112.4144 116.5761 159.2106 192.2231 230.9859 252.2422 296.6584 312.6135 325.1174 338.7484 359.4689 371.9194 426.2582 462.5257 484.6229 519.0337 602.5110 615.7784 689.2948 714.9375 737.4967 752.4118 774.0283 864.2963 944.9358 953.9062 1055.6068 1084.5615 1116.1503 1159.5069 1178.5146 1274.3986 1298.5646 1313.7380 1356.3427 1388.8303 1420.6645 1461.8416 1486.0599 1579.2469 1608.3491 1632.2475 1638.6727 2954.4110 3054.9133 3060.0166 3116.5072 3193.9597 3606.6220
redmass: 4.4131 7.7651 10.0839 7.4295 6.6420 1.0811 5.5899 4.7488 4.9310 6.2948 4.3101 4.1067 9.6697 12.0238 11.4296 2.6827 11.0014 1.4901 5.5169 3.7663 7.8475 11.3075 1.7744 5.4145 4.5671 6.4100 4.0056 1.6726 4.0464 2.2450 1.3138 1.3171 7.4075 3.8646 4.0779 2.4832 2.9040 1.3368 1.2166 1.0799 1.0465 9.3880 6.4786 10.4039 7.4552 1.0441 1.0920 1.0881 1.1010 1.0937 1.0808
irintensity: 0.6236 0.4577 2.1239 1.3516 2.6284 3.0201 7.1999 2.1179 14.3728 10.3105 3.4966 13.2003 8.1613 8.3971 0.4404 11.8994 0.5192 109.4780 22.1297 11.6514 15.8452 4.1307 82.1415 43.8369 20.1210 16.9069 10.1774 8.4122 1.4585 178.8126 1.7575 7.2062 75.4830 166.0509 26.1796 82.7913 38.4556 65.1342 22.3041 13.4158 25.4502 221.5121 238.1611 136.6442 500.3288 42.3833 13.6075 31.1806 2.6581 10.1653 77.0325
temp: 298.150 k
press: 1.00000 atm
elementType: 16 16 8 8 7 7 6 6 6 6 6 6 6 1 1 1 1 1 1
symmnumber: 1
zpe: 327601.4 jmol-1
zpe.correction: 0.124777 hartree
zpe.thermalcorrener: 0.137276 hartree
zpe.thermalcorrenthalpy: 0.138220 hartree
zpe.thermalcorrgfe: 0.085344 hartree
zpe.sumelectzpe: -1325.469246 hartree
zpe.sumelectthermal: -1325.456747 hartree
zpe.sumelectthermalent: -1325.455803 hartree
zpe.sumelectthermalfe: -1325.508678 hartree
dipole: 6.4697 0.6463 0.5666
dipole: 6.5266
quadrupole: -108.8483 -83.5093 -91.5141
quadrupole: 8.7666 -0.5699 -2.2016
quadrupole: -14.2244 11.1146 3.1098 8.7666 -0.5699 -2.2016
hfenergy: -1325.5940228 hartree
pointgroup: C01 [X(C7H6N2O2S2)]
dipole: -2.5535896 0.266821 -0.0360744 debye
dipolederiv: 0.5008195 0.0118732 0.0364973 0.2730333 -0.1014471 0.1171207 -0.2258636 0.1054877 -0.023738 -0.4824806 0.1489168 -0.1378104 0.2993616 -0.165738 0.1621722 -0.1179016 0.1467307 -0.0232905 -0.9099972 0.3145542 -0.2545905 0.5389942 -0.8541325 0.3633246 -0.3256738 0.3555416 -0.5774649 -1.6840831 0.139037 0.0277311 -0.4258288 -0.3844011 0.0002516 0.1338659 -0.016089 -0.3556923 -0.6411153 0.0236411 -0.0390821 -0.082996 -0.5389409 0.1135786 0.0178394 0.1100333 -0.3706742 -1.772992 0.1231403 -0.0635479 0.4293953 -0.4565771 0.0111467 0.2360661 0.0251771 -0.1736107 1.0542345 0.2709226 -0.0008653 0.9124566 -0.5275306 0.3456202 -0.2494531 0.2870917 -0.1092205 0.0346799 -0.4633788 0.3033222 -0.0956005 0.0684164 -0.1536137 0.1688794 -0.204817 -0.0340022 -0.0469611 -0.0030679 -0.0163314 -0.1852493 0.4148734 -0.1631678 -0.135746 -0.1149806 0.1787537 1.0834061 -0.133865 0.1778081 -0.7662141 1.1151996 -0.6421999 0.376999 -0.5334082 0.5587466 0.0076108 -0.1070398 0.0538119 -0.4888759 0.1555388 -0.3111957 0.258973 -0.2750899 -0.1503759 -0.0633754 -0.0056607 0.045248 -0.0587091 0.2690183 0.0330863 0.161781 0.0483345 0.2177136 2.4644192 -0.3140234 -0.0644986 -0.4495092 0.5191274 0.0000133 -0.1008498 -0.014101 0.1427445 0.1421863 0.0240812 -0.0299641 0.0318789 0.2712062 0.0550291 -0.0189739 0.05956 0.3221187 0.1311228 -0.0010413 0.0086697 0.0237539 0.0643595 0.1150976 0.0994932 0.0755972 0.2102257 0.0852634 0.0863462 0.0766259 0.0012535 0.0128357 -0.0330469 0.0089623 -0.0640324 -0.0560757 -0.0600492 0.074917 -0.145413 0.0359755 0.0362149 -0.0061026 -0.1997058 0.00444 -0.0423195 0.0119521 -0.1165453 0.0116117 0.0172852 0.1473432 0.0002492 -0.0429112 -0.0125434 0.1376494 0.1453591 -0.0728074 0.0107774 -0.0104052 -0.045366 -0.0073633 -0.0457805 0.0170678 0.1485123 unknown
polarizability: 248.1294362|-24.2959781|121.7705362|23.2947812|-37.9057496|76.4897168 unknown
InChI: InChI=1S/C7H6N2O2S2/c1-9(3-10)5-6-4(2-12-13-6)8-7(5)11/h2-3,8H,1H3
charge 0 multiplicity 1
19 atoms
S  -1.38758 1.718569 -1.446732
S  -3.632465 1.137314 -1.112407
O  1.071617 -2.223249 1.169917
O  4.024185 0.209761 -0.49327
N  -1.176581 -1.670546 0.625231
N  1.698458 0.43586 -0.291489
C  0.439618 -0.163893 -0.109307
C  -0.809983 0.297492 -0.504691
C  -1.843063 -0.629398 -0.034648
C  0.227301 -1.455914 0.629022
C  -3.174074 -0.362637 -0.220912
C  1.778838 1.900744 -0.455139
C  2.892346 -0.317483 -0.335074
H  -1.604451 -2.474452 1.081099
H  -4.009863 -0.957663 0.153138
H  1.336239 2.413008 0.415486
H  1.254622 2.2311 -1.375601
H  2.844654 2.162888 -0.545918
H  2.729082 -1.4013 -0.203102
