program: Gaussian 09
title: 000210862
version: EM64L-G09RevD.01
frameworkgroup: C1[X(C23H28N2O3)]
method: RPBEPBE
basis: SDD
operation: Freq
keyword: #p
keyword: freq=noraman
keyword: PBEPBE/SDD
title: #p freq=noraman PBEPBE/SDD
converged: YES YES NO NO
title: Mulliken charges:
elementType: O O O N N C C C C C C C C C C C C C C C C C C C C C C C H H H H H H H H H H H H H H H H H H H H H H H H H H H H
charge: -0.294782 -0.280650 -0.248298 -0.079871 -0.232729 -0.127043 -0.477838 -0.456200 -0.398805 -0.349656 -0.517731 0.275441 0.208956 -0.483935 0.260368 0.134639 -0.343081 -0.691699 -0.362416 -0.248223 0.277543 -0.228777 -0.334047 -0.346686 -0.579114 -0.249094 -0.230329 -0.223389 0.228034 0.203835 0.272287 0.240511 0.215358 0.248045 0.208626 0.224765 0.229739 0.249006 0.238660 0.250915 0.237089 0.250479 0.243583 0.214057 0.205152 0.245201 0.230355 0.227387 0.250769 0.274234 0.307637 0.216954 0.219285 0.230738 0.231986 0.232759
chargesum: 0.00000
title: Mulliken charges with hydrogens summed into heavy atoms:
elementType: O O O N N C C C C C C C C C C C C C C C C C C C C C C C
charge: -0.294782 -0.280650 -0.248298 -0.079871 -0.232729 0.100991 -0.001716 -0.000331 0.057866 0.104847 -0.030065 0.275441 0.208956 0.004069 0.260368 0.134639 -0.092602 -0.028908 -0.117214 -0.017868 0.277543 -0.001390 -0.083278 -0.072452 0.164763 -0.018356 0.001657 0.009370
polarizability: 3.52441036e+02 1.46036740e+01 2.65851037e+02 2.85986996e+01 -6.63950747e+00 1.91345689e+02
1716.lowfreq: -0.0007 -0.0006 -0.0002 0.2943 5.5574 11.1287 16.9436 29.2389 33.6711
frequency: 15.9584 29.1872 33.6196 38.7552 46.4382 52.1547 63.0539 76.9656 81.9632 92.1629 102.7638 111.8210 119.5876 143.1582 161.1451 179.3649 192.3572 204.4510 206.9618 219.6982 235.2076 267.8979 285.4922 298.0189 311.8633 332.6577 335.6341 376.5446 380.1879 396.1946 400.4307 416.2260 424.6706 451.9585 494.2766 499.8159 516.6175 553.4441 565.7113 569.9813 576.0193 611.6728 614.9988 632.1986 666.4944 689.9226 696.2487 736.9509 746.3409 755.2153 758.0991 760.0267 783.1039 801.7389 806.6339 807.6470 842.7283 847.3962 858.9281 866.7715 903.1997 923.4178 937.8097 943.5212 963.3699 969.4120 974.2694 978.9562 986.5097 990.1448 991.0488 1008.4171 1015.6110 1026.0079 1031.6256 1037.6112 1049.6673 1066.4038 1079.8500 1080.1991 1087.4897 1093.2737 1109.9735 1115.3196 1116.3298 1121.5263 1163.4224 1168.5909 1172.5327 1173.8217 1186.2966 1190.3684 1210.9071 1213.3295 1222.3641 1235.8885 1247.5171 1254.5841 1263.3334 1268.7477 1280.3038 1299.0116 1302.0985 1310.0718 1318.0482 1323.2175 1333.5143 1348.4122 1371.1866 1385.8889 1387.4869 1387.6427 1392.6871 1429.5874 1431.4472 1436.5954 1446.1975 1447.8664 1451.5342 1458.3487 1465.9884 1467.3021 1472.6951 1479.1761 1483.1986 1485.3496 1487.2902 1488.6111 1561.1736 1583.9047 1586.6447 1595.4896 1605.3727 1611.0604 2940.1600 2948.9059 2960.7497 2968.6217 2976.0139 2988.3006 2992.9444 2995.2935 3016.0010 3022.0287 3046.1742 3048.4070 3054.3146 3077.6344 3084.3684 3086.4184 3105.9034 3118.7074 3120.3451 3128.0030 3131.2018 3138.3055 3139.6162 3149.9023 3157.1949 3159.1890 3169.1292 3170.2540
redmass: 5.1955 4.0613 5.6323 4.2008 3.3224 4.6977 4.1775 3.7192 2.7383 5.0883 3.8791 3.0768 2.7182 3.1958 3.6996 3.9235 1.6256 2.6116 2.7242 3.9706 3.2878 1.3456 3.5358 3.5570 2.8982 3.2970 3.3126 2.7924 4.7218 4.6864 2.8013 3.8058 3.4455 2.8578 3.8398 3.2485 4.5338 4.9155 3.4253 3.2298 2.6091 6.0187 6.1670 5.4344 5.3700 3.8238 1.8139 4.0868 2.7465 1.5385 1.5399 3.1624 4.0519 2.1165 1.6390 1.3730 1.8410 2.5903 1.2516 2.8226 2.9052 2.4669 1.4124 1.3995 3.1423 3.5091 1.3605 6.7792 2.9585 5.8811 1.3834 1.3497 1.6377 2.1137 2.1920 2.0547 2.1552 2.2558 1.9232 1.8015 2.0166 2.4224 1.8119 1.4004 1.7586 1.5064 1.3133 1.3665 1.0770 1.2693 1.2247 1.3373 1.9204 2.3837 1.9010 1.5470 2.4453 1.3480 1.5200 1.6024 1.7440 1.5964 1.3049 1.3728 1.2839 1.4580 1.5834 1.4508 8.4492 1.3770 9.2309 1.3412 1.4458 1.6596 1.2064 1.9157 1.1151 1.3630 1.1373 1.0895 1.1131 1.0438 1.1604 2.1616 1.0897 1.6436 1.1354 1.1449 7.0527 6.9272 6.7559 6.6453 6.7194 6.2159 1.0689 1.0703 1.0312 1.0612 1.0636 1.0560 1.0409 1.0747 1.0801 1.0951 1.0983 1.1003 1.1040 1.0933 1.1002 1.0917 1.0994 1.1028 1.0955 1.0851 1.0855 1.0881 1.0901 1.0924 1.0935 1.0959 1.1012 1.1001
irintensity: 0.8703 0.3455 1.7255 0.3820 1.1085 0.5134 2.6503 0.5278 1.7983 3.2954 0.7608 2.6382 4.8594 0.9487 0.2309 1.6770 0.2979 6.3184 2.0168 0.8150 2.4596 0.3008 11.6832 7.2812 1.2263 0.8397 1.5499 24.0638 4.1132 10.2001 0.0946 0.7340 1.6437 3.3117 16.8289 9.3297 0.6662 10.8249 1.6795 9.8949 2.1772 1.9855 2.9932 3.0161 14.3586 3.8472 47.8221 0.3980 0.9435 53.0983 86.2189 13.6831 7.6573 2.4449 5.6877 11.9744 1.6218 8.5917 0.4076 2.3379 10.0322 2.7896 0.6560 1.9059 48.5794 10.0519 0.9543 35.3190 18.0772 8.1605 0.4036 0.1881 4.7220 0.8878 4.9861 18.3640 9.1505 27.0705 2.5465 8.9083 4.5830 0.2365 46.7423 2.8533 11.9552 19.2301 0.6984 17.5891 4.8764 1.2338 33.9687 3.4609 79.1439 36.6620 83.1029 47.0671 113.5947 10.2394 29.4608 15.6301 21.9457 98.0149 16.6218 16.1085 7.4826 45.3297 44.2722 25.4769 9.3673 32.9100 3.7702 4.3812 52.6147 24.9124 11.4388 22.6560 28.6727 12.6627 24.9826 22.4395 8.7172 13.6838 65.7275 5.7600 10.7280 73.9383 20.6901 6.6241 131.7396 92.4498 87.4288 37.7193 82.9118 8.1762 56.7407 50.5181 53.9837 34.5280 71.3814 24.2427 32.6035 29.8440 80.3191 6.4886 7.6446 32.3721 38.6348 7.1911 32.1835 30.2177 25.9721 5.0660 7.5863 0.2094 0.3280 6.4591 13.4681 17.6873 19.4677 21.9404 24.7097 18.4669
temp: 298.150 k
press: 1.00000 atm
elementType: 8 8 8 7 7 6 6 6 6 6 6 6 6 6 6 6 6 6 6 6 6 6 6 6 6 6 6 6 1 1 1 1 1 1 1 1 1 1 1 1 1 1 1 1 1 1 1 1 1 1 1 1 1 1 1 1
symmnumber: 1
zpe: 1217348.0 jmol-1
zpe.correction: 0.463663 hartree
zpe.thermalcorrener: 0.490719 hartree
zpe.thermalcorrenthalpy: 0.491663 hartree
zpe.thermalcorrgfe: 0.404144 hartree
zpe.sumelectzpe: -1226.321229 hartree
zpe.sumelectthermal: -1226.294174 hartree
zpe.sumelectthermalent: -1226.293229 hartree
zpe.sumelectthermalfe: -1226.380749 hartree
dipole: -0.2592 -1.8660 -1.8635
dipole: 2.6499
quadrupole: -129.0080 -154.8294 -173.6861
quadrupole: 6.4813 5.8035 -5.1821
quadrupole: 23.4998 -2.3216 -21.1782 6.4813 5.8035 -5.1821
hfenergy: -1226.7848926 hartree
pointgroup: C01 [X(C23H28N2O3)]
dipole: -0.1759828 -0.860928 0.5609942 debye
polarizability: 353.1635257|31.848733|191.6761234|2.7675972|-3.797818|264.798112 unknown
InChI: InChI=1S/C23H28N2O3/c1-3-23(27)25(20-11-7-8-12-22(20)28-2)19-13-15-24(17-19)16-14-21(26)18-9-5-4-6-10-18/h4-12,19H,3,13-17H2,1-2H3
charge 0 multiplicity 1
56 atoms
O  -1.222576 2.193084 -1.593004
O  -1.886807 -0.320864 1.39347
O  2.091102 -0.30969 1.942432
N  0.184222 -1.101546 -1.767501
N  -2.649562 0.373538 -1.173385
C  -2.153384 -0.567314 -2.242428
C  -1.286995 0.028977 -3.383174
C  -1.187406 -1.664905 -1.693995
C  0.19288 -0.117637 -2.904102
C  0.725262 -0.58778 -0.485333
C  2.263262 -0.57391 -0.477937
C  -3.603006 -0.234224 -0.266782
C  -2.181944 1.675971 -0.940797
C  -2.908512 2.477292 0.153205
C  -3.20937 -0.613841 1.055305
C  2.840837 -0.329681 0.91674
C  -4.920257 -0.509525 -0.692056
C  -2.692883 3.994026 -0.007606
C  -4.138139 -1.239299 1.921972
C  -5.848633 -1.141942 0.166309
C  4.325545 -0.133751 1.067558
C  -5.452181 -1.501606 1.473127
C  5.219005 -0.216308 -0.034721
C  4.848247 0.136766 2.361933
C  -1.370554 -0.743109 2.704392
C  6.605238 -0.031962 0.155032
C  6.231333 0.324268 2.550639
C  7.114373 0.240176 1.446374
H  -3.064517 -1.038277 -2.65782
H  -1.466099 -0.596749 -4.278755
H  -1.535154 1.071568 -3.624495
H  -1.431741 -1.988234 -0.66967
H  -1.274306 -2.547365 -2.363096
H  0.559362 0.862085 -2.547659
H  0.841433 -0.4705 -3.72926
H  0.383454 -1.2555 0.321666
H  0.34934 0.42959 -0.238561
H  2.631539 -1.551399 -0.854786
H  2.653305 0.188789 -1.18067
H  -2.505049 2.141869 1.129191
H  -3.986229 2.231563 0.160219
H  -5.214712 -0.208139 -1.703935
H  -1.616782 4.226935 -0.062676
H  -3.158181 4.367932 -0.936833
H  -3.135438 4.537431 0.847063
H  -3.843322 -1.523856 2.936593
H  -6.867799 -1.342844 -0.178964
H  -6.164252 -1.987128 2.149618
H  4.837561 -0.427124 -1.038965
H  4.144271 0.194426 3.198856
H  -0.299915 -0.489064 2.674977
H  -1.49528 -1.833936 2.847544
H  -1.878202 -0.198612 3.523497
H  7.287627 -0.098742 -0.699314
H  6.624737 0.535612 3.551027
H  8.190754 0.385963 1.591637
