program: Gaussian 09
title: 000210859
version: EM64L-G09RevD.01
frameworkgroup: C1[X(C22H26N2O2)]
method: RPBEPBE
basis: SDD
operation: Freq
keyword: #p
keyword: freq=noraman
keyword: PBEPBE/SDD
title: #p freq=noraman PBEPBE/SDD
converged: YES YES NO NO
title: Mulliken charges:
elementType: O O N N C C C C C C C C C C C C C C C C C C C C C C H H H H H H H H H H H H H H H H H H H H H H H H H H
charge: -0.287069 -0.231806 -0.053074 -0.274818 -0.063018 -0.473867 -0.504119 -0.434024 -0.332879 -0.540724 0.360102 0.192202 -0.476755 0.126695 -0.354932 -0.322341 -0.680337 0.280087 -0.223524 -0.213560 -0.240518 -0.336690 -0.346688 -0.249037 -0.229665 -0.222850 0.275849 0.249314 0.207229 0.229243 0.239142 0.223039 0.215311 0.220400 0.215410 0.255788 0.232057 0.236802 0.241396 0.254137 0.244290 0.222071 0.236975 0.205901 0.230141 0.241011 0.232671 0.250481 0.276234 0.231220 0.233313 0.233784
chargesum: 0.00000
title: Mulliken charges with hydrogens summed into heavy atoms:
elementType: O O N N C C C C C C C C C C C C C C C C C C C C C C
charge: -0.287069 -0.231806 -0.053074 -0.274818 0.212831 -0.017323 -0.035734 0.004326 0.102931 -0.052878 0.360102 0.192202 0.001442 0.126695 -0.100794 -0.078051 -0.015390 0.280087 0.006617 0.027451 -0.007847 -0.086209 -0.070454 -0.017817 0.003648 0.010934
polarizability: 3.21202346e+02 1.58634948e+01 2.53732768e+02 4.97354560e+00 -6.22578392e+00 1.78948996e+02
1716.lowfreq: -11.1879 -7.4477 -4.1894 -0.0010 -0.0003 0.0007 5.5530 14.2201 19.6354
frequency: -10.7275 13.8213 19.5663 29.1396 37.0449 53.1241 59.9714 66.1381 77.8527 82.2820 98.9346 105.4615 125.0800 159.7766 169.6133 188.2026 213.3537 227.8575 250.1683 277.8890 289.6864 310.8052 320.7914 381.2948 387.3403 400.7966 410.7311 414.1257 420.0937 447.1876 470.8236 492.4057 548.6207 563.7886 571.2012 611.6268 613.7535 616.2819 630.1286 637.9841 676.1186 697.5572 707.3011 711.9629 756.7316 766.3724 771.5109 797.6238 806.8078 821.6487 834.7168 853.8570 860.2707 861.9959 914.1334 928.1906 937.5337 944.4953 954.5331 977.6236 979.8437 989.1611 989.9924 991.9246 995.6823 998.5145 1009.3347 1018.6007 1023.1986 1024.3423 1029.5165 1041.5563 1059.8845 1074.8428 1077.1332 1077.8562 1086.8923 1087.7392 1107.6450 1112.4962 1160.2698 1172.2611 1173.0363 1180.5603 1184.5229 1188.2851 1200.2540 1222.3136 1237.1331 1249.2353 1250.5089 1269.7798 1286.8160 1293.4964 1298.5352 1305.4993 1306.0456 1316.3803 1319.1637 1326.8496 1345.8585 1370.5680 1377.4739 1387.6561 1389.7912 1393.1685 1433.2739 1434.3769 1437.0463 1444.6037 1463.4744 1465.6889 1466.5320 1470.4604 1477.0639 1479.5900 1480.2463 1482.5434 1565.7586 1580.9733 1587.5211 1597.2314 1607.3707 1611.7889 2913.4450 2974.9583 2983.9107 2985.1654 2996.0452 2996.8097 3014.3741 3022.2812 3034.3980 3039.9204 3053.9210 3069.4179 3081.5631 3084.7485 3090.4183 3105.2236 3127.3227 3128.6491 3137.5697 3138.6518 3147.7801 3150.1419 3156.9640 3158.8684 3169.3398 3171.4440
redmass: 4.9765 5.6170 5.9409 3.7913 2.9672 3.4822 4.9757 4.3833 2.8818 3.7391 3.2907 3.2100 2.8257 3.6579 2.4539 1.2121 4.5031 3.5494 3.6942 3.7807 3.7728 3.9846 4.3072 2.7289 3.8843 2.8199 3.1591 3.6842 3.3083 4.0065 3.1563 4.2171 2.6858 3.1724 2.2822 3.8734 5.6132 6.0876 4.9640 4.3329 5.3103 1.8337 1.8113 4.0861 1.5068 4.4190 1.9947 1.3691 1.5908 2.8148 3.8369 1.2416 1.2575 2.1784 2.7082 1.4341 2.2087 1.4147 2.2052 3.8815 1.3791 5.0123 6.0976 1.3884 3.3991 1.3284 1.4018 1.8580 2.0081 2.2648 2.2403 2.1388 2.3507 1.5639 1.6036 2.2541 1.7858 2.4297 2.4316 2.5666 1.2799 1.0574 1.0713 1.1250 1.3402 1.1270 1.5666 1.9426 3.5612 1.3200 1.6001 1.2377 1.6588 1.3032 1.3267 1.4813 1.4588 1.2594 1.4196 1.5097 2.0849 7.7317 1.4330 9.2581 1.4834 1.2157 1.3119 2.1225 1.7253 1.1087 1.0944 1.0414 1.0918 1.0863 1.1954 2.1596 1.1389 1.7778 6.9947 7.6009 6.3196 6.7309 6.3210 6.3233 1.0692 1.0604 1.0606 1.0661 1.0375 1.0663 1.0602 1.0951 1.0977 1.0856 1.0939 1.0981 1.1018 1.1012 1.1001 1.0997 1.0857 1.0851 1.0882 1.0880 1.0925 1.0922 1.0965 1.0960 1.1013 1.1012
irintensity: 0.6801 0.6497 1.0342 0.5952 0.8644 0.7495 0.9282 0.3602 2.5506 2.1766 1.9867 0.0323 0.8306 0.4513 1.7546 0.6057 0.2406 10.0425 0.3036 2.9372 7.8190 2.4315 2.9651 4.5343 18.8397 0.0837 0.3769 0.5959 1.8082 7.2699 3.8203 10.6134 9.7916 1.7344 6.5295 1.3645 0.3649 0.7019 11.8034 16.2722 21.9578 46.8979 58.0590 8.7425 64.4982 5.8307 33.7671 13.1637 1.8208 3.7713 1.8152 0.8231 0.7966 17.5647 3.3568 1.2242 4.8293 0.9616 33.0895 36.8673 0.2568 5.1990 4.6930 0.3881 1.2440 0.0264 0.9012 5.9599 1.1483 4.0517 9.2591 28.6905 26.5184 7.9989 5.3566 15.0554 8.0201 0.8880 1.1902 13.9739 24.2827 0.0052 5.1959 3.4700 11.8288 32.6662 25.4921 71.2770 175.2149 12.3449 88.1234 5.0977 22.3444 21.2793 21.4550 36.8811 18.5327 5.1513 12.8341 45.0345 82.7952 1.9149 32.6409 3.5156 36.1753 23.5209 10.7185 5.3605 23.4719 24.3061 10.7540 12.9307 8.4279 19.4306 14.5221 3.2095 10.5870 47.6963 110.9895 270.3075 7.2308 30.8909 6.7077 7.2966 54.0673 30.4473 27.2966 56.6483 31.8487 46.3566 15.3820 7.6889 6.5625 2.3204 18.1208 33.9014 12.5932 54.1100 32.5579 26.9121 2.7180 0.1176 1.9244 6.5560 13.6144 15.1033 30.3086 23.5629 23.1250 10.0629
temp: 298.150 k
press: 1.00000 atm
elementType: 8 8 7 7 6 6 6 6 6 6 6 6 6 6 6 6 6 6 6 6 6 6 6 6 6 6 1 1 1 1 1 1 1 1 1 1 1 1 1 1 1 1 1 1 1 1 1 1 1 1 1 1
symmnumber: 1
zpe: 1132721.4 jmol-1
zpe.correction: 0.431431 hartree
zpe.thermalcorrener: 0.455427 hartree
zpe.thermalcorrenthalpy: 0.456371 hartree
zpe.thermalcorrgfe: 0.374359 hartree
zpe.sumelectzpe: -1111.972086 hartree
zpe.sumelectthermal: -1111.948090 hartree
zpe.sumelectthermalent: -1111.947145 hartree
zpe.sumelectthermalfe: -1112.029158 hartree
dipole: 3.8384 2.0253 2.6532
dipole: 5.0867
quadrupole: -144.5803 -153.5327 -151.3247
quadrupole: -17.8792 -3.7819 -3.7041
quadrupole: 5.2323 -3.7201 -1.5122 -17.8792 -3.7819 -3.7041
hfenergy: -1112.4035165 hartree
pointgroup: C01 [X(C22H26N2O2)]
dipole: -1.4849118 0.7931433 -1.0821289 debye
polarizability: 318.5396021|-20.551222|257.1024253|2.1062488|-2.3820603|178.2420817 unknown
InChI: InChI=1S/C22H26N2O2/c1-2-22(26)24(19-11-7-4-8-12-19)20-13-15-23(17-20)16-14-21(25)18-9-5-3-6-10-18/h3-12,20H,2,13-17H2,1H3
charge 0 multiplicity 1
52 atoms
O  4.835514 -2.289261 0.681206
O  -2.360784 1.519002 0.878603
N  -0.107687 -2.0418 0.202493
N  3.268201 -0.793381 -0.177004
C  2.313658 -1.926206 -0.382089
C  1.262125 -2.144863 0.784934
C  1.438265 -1.819441 -1.662196
C  0.086844 -2.456519 -1.220739
C  -0.758748 -0.713903 0.365965
C  -2.28668 -0.827261 0.224551
C  2.903674 0.557201 -0.553917
C  4.527505 -1.096291 0.370273
C  5.499663 0.075452 0.570301
C  -3.008769 0.486884 0.52536
C  3.340915 1.082949 -1.795933
C  2.102119 1.356104 0.297984
C  6.727976 -0.328296 1.405574
C  -4.508215 0.533813 0.404772
C  2.986872 2.395716 -2.177245
C  1.737268 2.665385 -0.090485
C  2.181655 3.189547 -1.325977
C  -5.280589 -0.604905 0.048345
C  -5.170313 1.765306 0.662952
C  -6.685504 -0.51192 -0.048386
C  -6.572254 1.85815 0.565126
C  -7.334201 0.718549 0.208686
H  2.963775 -2.816818 -0.425515
H  1.40533 -3.162074 1.195054
H  1.399626 -1.428097 1.611247
H  1.896931 -2.335688 -2.523175
H  1.278551 -0.764128 -1.94533
H  0.153268 -3.561398 -1.263595
H  -0.7658 -2.144737 -1.847642
H  -0.532952 -0.34392 1.381402
H  -0.376742 0.060558 -0.338388
H  -2.648268 -1.617512 0.912914
H  -2.563673 -1.168634 -0.793493
H  5.820958 0.442477 -0.424939
H  4.965918 0.924542 1.037952
H  3.949494 0.453268 -2.455079
H  1.773937 0.957394 1.263345
H  6.432573 -0.63206 2.424707
H  7.245203 -1.188044 0.948462
H  7.435182 0.517444 1.481454
H  3.331293 2.795432 -3.13756
H  1.104014 3.267781 0.569229
H  1.89992 4.204996 -1.625248
H  -4.791861 -1.564523 -0.149702
H  -4.557791 2.630226 0.939092
H  -7.274431 -1.394303 -0.321567
H  -7.074014 2.81112 0.765576
H  -8.425154 0.788985 0.133147
