program: Gaussian 09
title: 000210856
version: EM64L-G09RevD.01
frameworkgroup: C1[X(C19H16I3NO3)]
method: RPBEPBE
basis: SDD
operation: Freq
keyword: #p
keyword: freq=noraman
keyword: PBEPBE/SDD
title: #p freq=noraman PBEPBE/SDD
converged: NO YES NO NO
title: Mulliken charges:
elementType: I I I O O O N C C C C C C C C C C C C C C C C C C C H H H H H H H H H H H H H H H H
charge: 0.112526 0.139413 0.147330 -0.217229 -0.413050 -0.226139 -0.318821 -0.386405 -0.436171 -0.509774 0.775061 0.181903 -0.695364 -0.308715 0.766003 -0.681100 -0.514358 0.495997 -0.619701 -0.097626 0.162570 -0.363232 -0.424742 -0.243034 -0.227564 -0.240280 0.248996 0.244340 0.241126 0.232516 0.257760 0.249337 0.283179 0.270665 0.271341 0.278254 0.270481 0.230521 0.227916 0.228391 0.230180 0.377501
chargesum: 0.00000
title: Mulliken charges with hydrogens summed into heavy atoms:
elementType: I I I O O O N C C C C C C C C C C C C C C C C C C C
charge: 0.112526 0.139413 0.147330 -0.217229 -0.035550 -0.226139 -0.318821 0.106931 0.037470 -0.002677 0.775061 0.181903 -0.141521 -0.037374 0.766003 -0.681100 -0.514358 0.495997 -0.619701 0.180628 0.162570 -0.092751 -0.194221 -0.015118 0.000827 -0.010100
polarizability: 3.88399547e+02 4.26528227e+00 3.33094975e+02 -3.36698136e+01 1.46850048e+00 1.65023618e+02
1716.lowfreq: -6.9387 -3.0980 -0.0006 -0.0005 -0.0003 5.6445 14.1223 17.3005 18.9369
frequency: 13.7825 17.2206 18.6833 26.3907 34.0064 47.6446 60.5705 63.9249 66.5243 80.8343 86.0637 97.2640 103.4695 139.0500 144.8280 153.8585 158.2813 161.0196 170.9039 183.1343 233.8009 280.6629 287.8587 311.0114 316.5160 349.1614 374.5872 405.0539 420.8207 432.7496 496.8392 507.7029 515.1266 529.6045 549.6236 576.3241 601.8361 614.2426 624.8479 631.5659 641.7432 659.3343 674.2150 706.4470 712.2760 717.9757 746.3031 767.9254 806.2074 815.9883 847.6856 857.1774 874.1920 879.9876 892.2604 925.1395 930.5514 977.2036 981.0691 990.6069 992.4457 999.3104 1003.8928 1014.8080 1029.3061 1035.8120 1056.4699 1073.2515 1084.0239 1122.5981 1159.4005 1165.1420 1173.3673 1191.8588 1192.3166 1195.6881 1213.0999 1217.1459 1220.0110 1241.5023 1267.2759 1271.3791 1279.8508 1308.0061 1317.2044 1322.6406 1334.9328 1342.2511 1365.0292 1369.3861 1388.1962 1413.8371 1445.1477 1447.7963 1465.6895 1474.0032 1482.0757 1496.1760 1509.4441 1541.5047 1593.0487 1610.7551 1654.6625 1662.3009 2976.8246 3006.5872 3010.6397 3022.1537 3051.0373 3065.9893 3083.5276 3088.5327 3101.1289 3118.6627 3128.3756 3140.4805 3151.4691 3165.2729 3186.3445 3499.4918
redmass: 8.4975 8.1819 9.9456 7.1115 4.1767 5.8783 6.4767 6.6450 6.4038 11.8089 38.1194 10.9889 28.6068 4.7380 3.0938 6.2663 6.2186 50.7847 2.2187 7.3730 5.2013 6.0447 4.5624 4.6824 5.6329 8.9508 4.6289 2.8407 5.2198 5.0956 3.5343 4.3793 3.3399 4.3291 4.0807 3.8727 4.4484 5.6870 2.7211 2.5616 4.0101 3.8638 6.3237 2.0203 2.9504 4.4406 6.1590 2.0321 3.4067 2.9668 2.6320 1.2558 3.8218 1.4236 1.4199 1.5359 2.3085 2.7138 1.4219 5.7846 3.1140 1.9581 2.7433 6.0936 2.2077 2.3247 2.4459 1.6926 1.6114 4.4777 1.2627 1.7077 1.0619 1.4208 1.2989 2.2669 2.0724 1.4414 1.7582 1.6590 1.4217 2.7091 1.3282 2.2645 1.3938 1.9578 1.9282 1.6287 2.0403 2.1557 4.0128 4.1331 2.1208 1.0879 1.1079 1.0910 2.2256 1.1044 8.3563 9.0913 6.0102 5.9946 11.9654 8.1014 1.0634 1.0661 1.0616 1.0645 1.0986 1.0875 1.0967 1.0993 1.1018 1.0870 1.0868 1.0919 1.0957 1.1014 1.0933 1.0637
irintensity: 1.3074 0.8963 0.2881 0.8502 0.1920 0.2042 1.7390 2.0610 0.9628 2.0887 0.0384 0.6697 0.2174 2.6303 0.6248 0.0456 1.7298 0.0306 0.2591 1.5579 0.5207 0.1622 4.1199 0.0836 1.4947 6.6397 2.7351 0.0362 8.6035 8.1814 0.9674 0.6980 0.5691 11.5191 34.0144 7.9485 26.3729 6.2639 57.9499 25.7728 17.8731 53.1282 32.0526 57.8187 17.8304 39.0678 2.6298 35.2163 9.3632 12.4582 28.0702 0.4582 2.2013 11.8974 2.0703 5.5003 13.5703 35.3914 0.7163 2.3407 8.1289 15.8372 48.3632 6.5329 6.9045 6.9373 194.4477 1.5200 6.3636 8.5102 3.7009 39.3451 0.2798 38.2921 17.5226 0.0642 44.8754 10.6403 20.2263 2.7031 16.9121 26.3638 4.4081 6.8625 2.5891 4.7548 50.2644 15.6773 22.6487 50.9678 10.1485 248.3302 12.7853 6.5530 15.3003 11.7428 33.3404 3.5530 29.7609 33.1224 2.0851 8.3428 263.2580 126.6887 41.7917 13.4891 7.7712 28.1496 17.8176 3.1590 2.7083 16.4281 21.4401 8.1337 0.8620 20.4425 19.0159 27.8612 0.2372 22.4075
temp: 298.150 k
press: 1.00000 atm
elementType: 53 53 53 8 8 8 7 6 6 6 6 6 6 6 6 6 6 6 6 6 6 6 6 6 6 6 1 1 1 1 1 1 1 1 1 1 1 1 1 1 1 1
symmnumber: 1
zpe: 800494.6 jmol-1
zpe.correction: 0.304892 hartree
zpe.thermalcorrener: 0.330683 hartree
zpe.thermalcorrenthalpy: 0.331627 hartree
zpe.thermalcorrgfe: 0.241336 hartree
zpe.sumelectzpe: -1046.715552 hartree
zpe.sumelectthermal: -1046.689761 hartree
zpe.sumelectthermalent: -1046.688817 hartree
zpe.sumelectthermalfe: -1046.779108 hartree
dipole: -0.3447 -1.9948 4.0258
dipole: 4.5061
quadrupole: -177.8416 -181.1536 -201.6258
quadrupole: -0.5183 -18.5580 -6.5301
quadrupole: 9.0321 5.7201 -14.7521 -0.5183 -18.5580 -6.5301
hfenergy: -1047.0204445 hartree
pointgroup: C01 [X(C19H16I3N1O3)]
dipole: 0.0415402 0.3167239 1.7438381 debye
polarizability: 381.015111|-13.0820785|322.9206789|51.1504827|38.6371333|182.58235 unknown
InChI: InChI=1S/C19H16I3NO3/c20-14-10-15(21)18(23-8-4-7-16(23)24)17(22)13(14)9-12(19(25)26)11-5-2-1-3-6-11/h1-3,5-6,10,12,25H,4,7-9H2
charge 0 multiplicity 1
42 atoms
I  0.721444 2.322332 0.066073
I  4.766447 -2.290573 -0.049173
I  -0.849922 -3.417303 -1.95016
O  4.094961 1.59761 -1.689107
O  -1.647664 -1.109442 2.421214
O  -2.819895 -2.295023 0.811277
N  3.465697 0.695473 0.407822
C  3.80453 0.843177 1.847017
C  5.170103 1.585836 1.808347
C  5.156954 2.346238 0.459489
C  2.45912 -0.197723 -0.05993
C  4.216004 1.533565 -0.440767
C  -1.34364 -0.151248 -0.953402
C  -2.155298 0.066627 0.376884
C  0.084318 -0.635846 -0.759357
C  1.118802 0.226247 -0.285249
C  2.772993 -1.552843 -0.34274
C  -3.532426 0.654257 0.043121
C  0.486404 -1.971243 -1.062029
C  1.802849 -2.434495 -0.850713
C  -2.268073 -1.232025 1.168984
C  -4.542027 -0.125591 -0.577948
C  -3.782329 2.025003 0.302994
C  -5.777195 0.460593 -0.931324
C  -5.017294 2.611663 -0.054539
C  -6.018908 1.83042 -0.674586
H  3.876789 -0.147347 2.329564
H  3.024094 1.433432 2.367005
H  5.989543 0.845983 1.814551
H  5.297165 2.249565 2.678951
H  6.146332 2.436922 -0.015637
H  4.738018 3.366237 0.557926
H  -1.341834 0.822168 -1.477726
H  -1.902619 -0.862331 -1.583556
H  -1.609442 0.782433 1.01129
H  2.070982 -3.463611 -1.094499
H  -4.365814 -1.190827 -0.763594
H  -3.006537 2.634171 0.783458
H  -6.551654 -0.151826 -1.406619
H  -5.196629 3.672787 0.151484
H  -6.977287 2.282906 -0.952748
H  -1.742762 -1.968653 2.917453
