program: Gaussian 09
title: 000210854
version: EM64L-G09RevD.01
frameworkgroup: C1[X(C14H14I3NO3)]
method: RPBEPBE
basis: SDD
operation: Freq
keyword: #p
keyword: freq=noraman
keyword: PBEPBE/SDD
title: #p freq=noraman PBEPBE/SDD
converged: NO YES NO NO
title: Mulliken charges:
elementType: I I I O O O N C C C C C C C C C C C C C C H H H H H H H H H H H H H H
charge: 0.121094 0.128946 0.141981 -0.243854 -0.401257 -0.210514 -0.297852 -0.398536 -0.396479 -0.397887 -0.489174 0.187961 0.781777 0.798311 -0.727296 -0.356809 -0.516505 -0.583236 -0.111124 -0.663286 0.150738 0.217216 0.219331 0.240396 0.250188 0.213193 0.222278 0.254093 0.238904 0.246412 0.276605 0.238110 0.233649 0.250373 0.382254
chargesum: 0.00000
title: Mulliken charges with hydrogens summed into heavy atoms:
elementType: I I I O O O N C C C C C C C C C C C C C C
charge: 0.121094 0.128946 0.141981 -0.243854 -0.019002 -0.210514 -0.297852 0.038011 0.094105 0.037584 0.003822 0.187961 0.781777 0.798311 -0.727296 -0.110396 -0.516505 -0.583236 0.165480 0.058847 0.150738
polarizability: 3.23400121e+02 1.18498096e+00 2.63017138e+02 5.71613900e+00 -2.97068846e+00 1.46726194e+02
1716.lowfreq: -4.2976 -2.9817 -0.0003 -0.0001 0.0001 7.8878 24.9386 28.4804 42.1170
frequency: 24.9211 28.4682 42.0780 47.2865 57.0567 77.1849 83.2836 88.9525 99.4986 101.5119 112.5714 139.1726 144.7520 156.8782 159.8774 167.6687 176.9422 194.5575 265.6396 298.6138 306.7020 320.5678 341.8467 372.8113 403.8142 444.9834 457.2809 473.6238 489.8269 502.5218 525.0551 557.8312 593.3266 616.4910 630.3600 632.9048 665.4538 695.0048 708.7207 751.1428 776.3833 815.7549 826.5433 877.7661 880.7810 909.5097 921.1425 975.7837 984.0410 1009.6315 1025.0504 1035.8609 1088.9448 1093.9705 1097.7690 1119.2617 1144.7727 1160.9251 1173.5442 1219.0802 1234.4988 1251.9864 1256.4717 1267.2971 1272.5144 1293.0386 1300.8358 1319.4843 1322.8441 1344.3771 1350.6862 1353.2263 1394.5118 1399.2150 1406.5257 1442.9622 1463.8993 1466.1803 1475.0414 1479.9058 1487.8063 1515.5657 1542.5832 1593.0120 1657.0388 2962.9312 2963.7230 2988.1625 2989.9505 2991.3226 3004.4559 3031.1396 3050.7673 3059.9046 3070.2413 3104.5369 3112.3250 3187.0340 3515.0905
redmass: 7.5267 9.0576 4.1462 5.8410 6.3799 13.2564 13.9898 17.3690 5.9865 5.9009 7.0361 2.7589 5.0419 5.6385 34.8799 5.7553 1.1712 3.1092 5.0209 2.5464 5.3970 2.8094 6.1131 8.7847 6.5719 3.9665 5.0058 2.5184 4.2287 4.1622 4.0859 4.4683 3.2407 4.4917 2.8627 2.0542 4.8721 7.4313 4.9753 5.4035 4.7626 2.2890 1.8200 1.4373 2.4684 2.6738 1.4125 2.4272 3.1051 3.1786 2.1293 3.5872 1.5561 1.6885 1.8019 2.4904 3.2740 2.0636 1.3700 1.9941 3.7437 1.4094 1.5435 1.4131 1.5092 2.1976 2.1649 4.5363 1.4918 1.4656 1.5075 2.3534 1.3517 1.7062 2.6512 1.1017 1.0880 1.0443 1.0986 1.0617 1.1068 9.5409 9.2586 10.6027 9.0640 1.0635 1.0783 1.0670 1.0635 1.0610 1.0352 1.0987 1.0982 1.1017 1.0977 1.1009 1.1001 1.0932 1.0641
irintensity: 0.5939 0.1271 1.0666 1.1586 0.0180 1.2235 1.2291 0.6146 1.0340 0.7409 0.8260 1.0811 1.8735 0.5828 0.0244 0.4201 0.0143 0.3313 1.3509 3.6790 0.9785 2.8661 4.1455 2.3184 13.6180 2.0453 20.4844 5.0669 22.5655 5.0571 16.7412 7.8600 12.4193 34.2484 19.5283 44.6747 1.7903 72.1634 29.9798 2.4559 16.7044 28.3802 0.5171 10.4224 15.4263 6.6521 2.4272 13.4961 7.1666 53.5598 70.4032 65.3328 19.2867 4.2788 28.6392 65.1192 14.4896 49.7516 2.7886 8.9053 22.8115 15.7801 23.8434 15.1307 5.5544 22.9508 106.9283 26.3269 14.3784 5.6010 3.2179 22.8574 14.0970 35.9598 160.0610 4.2619 14.1514 9.6602 21.7531 8.3038 7.7215 45.5471 27.7297 194.3271 279.1585 31.7618 37.6277 22.9851 20.0506 21.7427 17.3988 21.5669 52.3962 35.7939 17.6522 10.4137 10.4473 0.2059 29.6847
temp: 298.150 k
press: 1.00000 atm
elementType: 53 53 53 8 8 8 7 6 6 6 6 6 6 6 6 6 6 6 6 6 6 1 1 1 1 1 1 1 1 1 1 1 1 1 1
symmnumber: 1
zpe: 664027.9 jmol-1
zpe.correction: 0.252915 hartree
zpe.thermalcorrener: 0.275243 hartree
zpe.thermalcorrenthalpy: 0.276187 hartree
zpe.thermalcorrgfe: 0.196645 hartree
zpe.sumelectzpe: -855.291753 hartree
zpe.sumelectthermal: -855.269425 hartree
zpe.sumelectthermalent: -855.268481 hartree
zpe.sumelectthermalfe: -855.348022 hartree
dipole: 2.8599 0.6092 4.1310
dipole: 5.0611
quadrupole: -157.2960 -159.6076 -169.9814
quadrupole: 8.9841 6.5476 0.2847
quadrupole: 4.9990 2.6874 -7.6864 8.9841 6.5476 0.2847
hfenergy: -855.5446679 hartree
pointgroup: C01 [X(C14H14I3N1O3)]
dipole: -1.0605355 -0.4703545 1.6183147 debye
polarizability: 322.4492926|6.6529576|262.1585041|-10.0414574|12.774617|148.535656 unknown
InChI: InChI=1S/C14H14I3NO3/c1-7(14(20)21)11-8(15)6-9(16)13(12(11)17)18-5-3-2-4-10(18)19/h6-7,20H,2-5H2,1H3
charge 0 multiplicity 1
35 atoms
I  -0.136436 -2.568198 -0.342849
I  -2.134403 3.18018 0.468074
I  3.807827 2.330493 -0.080981
O  -2.371283 0.256968 -2.136909
O  3.48875 -0.694574 1.906528
O  5.179627 -1.167518 0.387069
N  -2.126476 -0.118929 0.143394
C  -3.897555 -1.355323 1.417471
C  -2.6276 -0.493858 1.499179
C  -4.913142 -0.707604 0.455749
C  -4.31153 -0.656896 -0.96355
C  -2.880119 -0.12526 -1.042652
C  -0.785237 0.396373 0.077951
C  1.68344 -0.01173 -0.151786
C  0.332046 -0.466724 -0.100383
C  2.83759 -0.978396 -0.410254
C  -0.528089 1.783258 0.209933
C  1.862533 1.395821 -0.020849
C  0.784946 2.285688 0.159457
C  3.356698 -0.915767 -1.867987
C  3.976403 -0.920826 0.611261
H  -4.31717 -1.457981 2.435117
H  -3.638593 -2.370043 1.057502
H  -2.833829 0.432924 2.073178
H  -1.819969 -1.041239 2.020135
H  -5.153311 0.315991 0.804794
H  -5.861323 -1.275584 0.442155
H  -4.914818 -0.037138 -1.649653
H  -4.28866 -1.674702 -1.402843
H  2.435525 -2.002644 -0.263755
H  0.966034 3.357235 0.255192
H  2.543524 -1.187425 -2.562819
H  3.722214 0.089942 -2.131162
H  4.191885 -1.624382 -1.996574
H  4.248401 -0.724634 2.549366
