program: Gaussian 09
title: 000216217
version: EM64L-G09RevD.01
frameworkgroup: C1[X(C12H16O4)]
method: RPBEPBE
basis: SDD
operation: Freq
keyword: #pfreq=noraman
keyword: PBEPBE/SDD
title: #p freq=noraman PBEPBE/SDD
converged: YES YES NO NO
title: Mulliken charges:
elementType: O O O O C C C C C C C C C C C C H H H H H H H H H H H H H H H H
charge: -0.443389 -0.492348 -0.445125 -0.253027 -0.418487 -0.295555 -0.347775 0.312263 -0.346791 0.096755 0.202820 -0.698533 -0.363874 -0.408670 -0.212179 0.103306 0.215892 0.218101 0.299074 0.194218 0.203542 0.192273 0.195386 0.210312 0.214354 0.209572 0.362437 0.280081 0.222743 0.238258 0.368059 0.386308
chargesum: 0.00000
title: Mulliken charges with hydrogens summed into heavy atoms:
elementType: O O O O C C C C C C C C C C C C
charge: -0.080953 -0.124288 -0.058817 -0.253027 0.015506 0.003519 0.049985 0.312263 0.040868 0.096755 0.202820 -0.064295 -0.083793 -0.185927 0.026079 0.103306
polarizability: 1.45143103e+02 -3.28836084e+00 1.64503615e+02 2.82760705e+01 6.17617422e+00 1.20572860e+02
1716.lowfreq: -5.8610 -4.3717 -0.0006 0.0002 0.0008 6.0968 28.3611 40.1041 62.4362
frequency: 28.3470 40.0165 62.4310 76.9772 88.5293 120.5047 146.3390 178.2470 197.6465 215.6694 236.5965 247.0267 259.1529 302.2182 342.8335 344.0384 378.0192 393.6559 405.8134 475.4986 490.1300 503.5979 532.3706 562.5778 571.9616 614.1398 619.9108 656.4554 718.2946 736.3965 747.0544 767.8639 805.6292 812.9704 887.2006 893.0460 904.2907 936.4276 958.1757 984.1219 999.0590 1031.6059 1039.5608 1074.2643 1084.6755 1101.7513 1112.4907 1142.5822 1172.3442 1189.6466 1205.2958 1213.8203 1221.3445 1250.9401 1274.3866 1289.8671 1291.8805 1315.3066 1327.3673 1342.9320 1352.4135 1386.2442 1389.1023 1412.2872 1448.7049 1465.3047 1468.0403 1470.5455 1476.4836 1480.7872 1491.3603 1578.0333 1608.2947 1625.3789 2961.8769 2970.8391 2972.0889 2985.5066 3003.9254 3027.0745 3052.3503 3068.8545 3069.5505 3113.0698 3138.0917 3155.3080 3177.5002 3492.5822 3504.7939 3590.1244
redmass: 8.0125 4.0813 5.5825 3.0803 1.9000 2.8805 3.2870 3.2024 6.8061 2.5903 1.2681 5.3714 4.8879 3.9501 3.5814 1.3391 6.3450 5.0895 3.5427 4.5166 2.4449 3.2861 1.3809 4.3205 3.4755 3.1304 1.5536 3.4955 5.3607 1.1259 1.8177 3.0617 1.6947 1.9371 2.0160 4.0626 1.4327 1.4065 4.2863 1.3344 3.9381 3.0489 2.8973 2.4101 2.3926 1.5861 2.0784 1.5619 1.3681 1.8071 1.5232 1.5674 1.8128 1.5394 1.2435 1.3157 1.1123 2.6819 1.4325 1.2729 1.5983 3.4629 1.2422 1.3397 2.3377 1.7666 1.3747 1.0859 1.0430 1.0716 1.0935 6.5368 6.6388 7.9148 1.0586 1.0477 1.0501 1.0591 1.0971 1.1012 1.1032 1.1007 1.0993 1.0900 1.0864 1.0905 1.0977 1.0649 1.0637 1.0662
irintensity: 1.3156 0.4635 0.7595 0.2343 0.3056 0.5747 1.6893 2.3437 2.5990 0.3465 0.0363 1.2268 1.8479 20.6926 16.3767 76.4046 2.5032 13.1403 8.6483 1.2308 35.0342 9.5192 147.1639 30.4624 20.6969 30.9457 88.1572 21.3902 24.8024 16.0925 63.4741 3.5776 23.6129 6.6684 9.6020 40.1241 2.0173 5.9920 71.4490 2.2533 21.1828 210.5636 28.0374 0.2412 21.7331 12.2896 15.5317 146.9693 42.3559 10.7142 8.2334 178.0332 7.6966 14.4651 2.9285 14.3578 2.8296 67.7359 0.5426 1.4485 1.4724 16.1067 9.3372 42.7883 24.9911 2.9066 0.5408 0.8034 12.3773 2.0720 18.2316 71.4691 75.0871 175.0713 16.7939 18.4843 41.4641 54.4871 6.7876 3.3954 27.9035 96.3851 56.1939 12.9794 2.7723 6.6043 9.2755 26.2107 39.4953 35.7381
temp: 298.150 k
press: 1.00000 atm
elementType: 8 8 8 8 6 6 6 6 6 6 6 6 6 6 6 6 1 1 1 1 1 1 1 1 1 1 1 1 1 1 1 1
symmnumber: 1
zpe: 681032.9 jmol-1
zpe.correction: 0.259392 hartree
zpe.thermalcorrener: 0.275915 hartree
zpe.thermalcorrenthalpy: 0.276859 hartree
zpe.thermalcorrgfe: 0.214747 hartree
zpe.sumelectzpe: -766.553942 hartree
zpe.sumelectthermal: -766.537419 hartree
zpe.sumelectthermalent: -766.536475 hartree
zpe.sumelectthermalfe: -766.598587 hartree
dipole: 0.0406 -2.7313 -3.0593
dipole: 4.1013
quadrupole: -94.6828 -83.8050 -100.3562
quadrupole: 12.0253 7.6498 10.7840
quadrupole: -1.7348 9.1430 -7.4082 12.0253 7.6498 10.7840
hfenergy: -766.8133339 hartree
pointgroup: C01 [X(C12H16O4)]
dipole: 0.2930886 1.4222637 0.7034948 debye
polarizability: 140.9732905|-4.2971005|164.686|-29.5821859|-5.7188023|124.5602867 unknown
InChI: InChI=1S/C12H16O4/c1-2-3-6-9(13)11-8(12(15)16)5-4-7-10(11)14/h4-5,7,9,13-15H,2-3,6H2,1H3
charge 0 multiplicity 1
32 atoms
O  0.019341 0.484586 -2.75887
O  -0.062507 2.611162 -1.071152
O  -0.335869 -2.599715 -0.182188
O  -2.258381 -2.685241 1.080444
C  1.849548 0.158816 -1.093725
C  0.363836 -0.116895 -1.45463
C  2.34552 -0.530285 0.197997
C  -0.617129 0.359798 -0.370733
C  3.848866 -0.279859 0.458401
C  -1.402372 -0.482163 0.478967
C  -0.812061 1.764777 -0.214744
C  4.35432 -0.952897 1.752877
C  -2.316314 0.075936 1.421463
C  -1.70449 2.320547 0.722875
C  -2.463077 1.465183 1.549894
C  -1.399028 -1.981578 0.492121
H  2.448371 -0.193807 -1.956627
H  2.008264 1.251939 -1.014638
H  0.22998 -1.192208 -1.61806
H  1.763329 -0.164015 1.068425
H  2.156545 -1.619944 0.135767
H  4.033448 0.812962 0.511924
H  4.435728 -0.651047 -0.406663
H  4.213588 -2.049546 1.710348
H  5.429696 -0.756703 1.919635
H  3.801287 -0.57953 2.635626
H  0.130547 1.468681 -2.662368
H  -2.902657 -0.61294 2.03566
H  -1.812328 3.410457 0.804049
H  -3.162554 1.884699 2.279375
H  -0.282541 3.561632 -0.912654
H  -0.455209 -3.585503 -0.100701
