program: Gaussian 09
title: 000210853
version: EM64L-G09RevD.01
frameworkgroup: C1[X(C13H12I3NO4)]
method: RPBEPBE
basis: SDD
operation: Freq
keyword: #p
keyword: freq=noraman
keyword: PBEPBE/SDD
title: #p freq=noraman PBEPBE/SDD
converged: NO YES NO NO
title: Mulliken charges:
elementType: I I I O O O O N C C C C C C C C C C C C C H H H H H H H H H H H H
charge: 0.122846 0.150882 0.148592 -0.235092 -0.232055 -0.401883 -0.208718 -0.297751 -0.367141 0.780783 0.802173 -0.356141 -0.311141 -0.725661 0.183397 -0.401337 -0.524030 -0.582621 -0.106594 -0.662383 0.151420 0.256985 0.239700 0.246262 0.213707 0.232997 0.264837 0.233715 0.278009 0.237670 0.233736 0.251594 0.383243
chargesum: 0.00000
title: Mulliken charges with hydrogens summed into heavy atoms:
elementType: I I I O O O O N C C C C C C C C C C C C C
charge: 0.122846 0.150882 0.148592 -0.235092 -0.232055 -0.018640 -0.208718 -0.297751 0.129545 0.780783 0.802173 -0.109879 0.135563 -0.725661 0.183397 0.097214 -0.524030 -0.582621 0.171415 0.060617 0.151420
polarizability: 3.11019176e+02 -6.01891920e-01 2.57375375e+02 4.84527048e+00 -2.42386265e+00 1.42513451e+02
1716.lowfreq: -3.8777 -0.0004 0.0004 0.0005 1.3917 7.4858 24.6526 27.9343 45.8808
frequency: 24.6304 27.9307 45.8628 50.1276 56.5621 76.1880 83.1559 88.6424 100.9228 112.3729 113.6296 142.9493 152.0842 160.0396 160.9044 168.6304 174.6615 193.9908 265.9582 301.7142 306.4381 335.1412 341.5167 373.1472 400.7460 457.3673 461.5096 480.3508 487.6254 509.8525 524.7958 560.6762 590.5810 614.9028 633.2586 640.9206 676.5059 697.2410 713.0004 756.4193 780.2328 819.8174 849.4677 879.0715 922.9136 964.4003 965.4667 995.7539 1010.4469 1024.6864 1034.8006 1068.0197 1092.7507 1102.9656 1119.2191 1146.5165 1194.5699 1219.3041 1230.8875 1238.8766 1251.4014 1261.1383 1270.0613 1295.5181 1305.9343 1322.6760 1324.4593 1354.1859 1361.8247 1394.0506 1398.2030 1408.3604 1434.5097 1456.0522 1466.0344 1471.6637 1479.9694 1515.2032 1543.2337 1602.9215 1658.8451 2954.9504 2958.9365 2962.1368 2985.7552 3005.3651 3047.0237 3093.9831 3096.8649 3105.4416 3113.3252 3187.2574 3514.7518
redmass: 10.0745 9.0343 6.5786 7.2394 6.3975 13.1183 14.7961 17.3428 30.8015 7.2403 3.2932 5.7029 5.1121 20.5045 4.4174 4.4064 1.1772 3.2320 5.0731 3.6691 5.4843 2.7879 5.8076 8.4729 7.7822 5.1950 4.8248 4.3705 4.2671 3.6223 4.0581 5.3477 3.4226 4.5456 1.7700 4.6547 4.4312 7.4883 4.8048 5.9396 4.5028 3.1028 3.3908 1.4115 2.4057 2.9584 2.6475 2.3513 3.3864 2.1642 3.2651 4.0431 2.0536 2.2211 2.4927 3.9126 1.1845 1.9810 2.0360 1.8186 1.6615 1.4425 1.7069 2.1989 2.3873 1.5332 2.2631 2.3243 1.2712 1.4559 1.5788 2.8423 1.1097 1.0888 1.0444 1.1215 1.0618 9.6427 9.3298 10.7597 9.1001 1.0685 1.0686 1.0786 1.0584 1.0353 1.1043 1.0947 1.0952 1.1008 1.1001 1.0932 1.0641
irintensity: 0.3403 0.1449 1.4056 0.6152 0.0399 1.1684 0.9649 0.4750 0.0441 0.4533 1.8873 2.4915 1.3797 0.1378 4.0142 2.8401 0.0308 0.5585 1.3538 6.4314 0.7657 9.3080 2.8144 3.0783 20.2754 17.2494 0.8498 3.4463 28.1182 9.5913 19.0659 2.3860 14.8781 36.5260 65.3010 4.8534 1.0886 87.0893 25.2109 4.3945 29.1193 13.6585 20.4301 10.4388 4.9650 23.4284 3.2620 4.8872 54.5065 49.0909 92.8665 35.0153 20.3729 22.8999 70.2142 5.5876 8.2531 12.0925 7.9264 56.9575 30.0905 8.6422 21.6609 9.4666 107.8664 16.1125 28.1397 24.5774 1.4042 8.3228 42.3811 156.3024 2.3736 10.2080 9.6026 14.1186 8.5819 46.2199 28.5162 199.5464 277.5186 25.8798 49.5759 32.3684 30.9791 17.1118 15.0102 21.8095 6.7834 10.1227 10.1623 0.2711 30.7914
temp: 298.150 k
press: 1.00000 atm
elementType: 53 53 53 8 8 8 8 7 6 6 6 6 6 6 6 6 6 6 6 6 6 1 1 1 1 1 1 1 1 1 1 1 1
symmnumber: 1
zpe: 600077.7 jmol-1
zpe.correction: 0.228558 hartree
zpe.thermalcorrener: 0.250664 hartree
zpe.thermalcorrenthalpy: 0.251608 hartree
zpe.thermalcorrgfe: 0.172566 hartree
zpe.sumelectzpe: -891.186004 hartree
zpe.sumelectthermal: -891.163898 hartree
zpe.sumelectthermalent: -891.162954 hartree
zpe.sumelectthermalfe: -891.241996 hartree
dipole: 0.3835 0.8556 3.7863
dipole: 3.9007
quadrupole: -175.5272 -156.1573 -165.6174
quadrupole: 9.2678 4.0302 1.1709
quadrupole: -9.7599 9.6100 0.1499 9.2678 4.0302 1.1709
hfenergy: -891.4145619 hartree
pointgroup: C01 [X(C13H12I3N1O4)]
dipole: 0.0836549 -0.485159 -1.4535431 debye
polarizability: 310.4057575|-4.1911992|256.1826642|-9.4726532|-12.6589006|144.3195796 unknown
InChI: InChI=1S/C13H12I3NO4/c1-6(13(19)20)10-7(14)4-8(15)12(11(10)16)17-2-3-21-5-9(17)18/h4,6,19H,2-3,5H2,1H3
charge 0 multiplicity 1
33 atoms
I  0.150816 -2.553886 0.340958
I  2.109118 3.204468 -0.505988
I  -3.824727 2.317454 0.090932
O  4.871898 -0.708744 -0.46793
O  2.429207 0.268041 2.132781
O  -3.48767 -0.705955 -1.898316
O  -5.173303 -1.187311 -0.376128
N  2.12276 -0.085814 -0.155389
C  2.656471 -0.474597 -1.492232
C  0.776918 0.417149 -0.091738
C  -1.684887 -0.009473 0.153291
C  -2.831164 -0.983699 0.41692
C  3.88339 -1.376958 -1.324075
C  -0.330977 -0.455362 0.096724
C  2.89491 -0.07953 1.010521
C  4.343052 -0.574129 0.893367
C  0.513098 1.802608 -0.227076
C  -1.874128 1.396865 0.020092
C  -0.803891 2.293767 -0.169144
C  -3.347779 -0.922353 1.875476
C  -3.972299 -0.933944 -0.602434
H  2.931243 0.435557 -2.059286
H  1.862336 -1.010847 -2.045105
H  -2.423386 -2.00597 0.270423
H  3.592609 -2.356628 -0.887354
H  4.381382 -1.538243 -2.293425
H  4.992366 0.150846 1.409196
H  4.401592 -1.544339 1.433455
H  -0.993622 3.363605 -0.267315
H  -2.532264 -1.188088 2.569732
H  -3.719755 0.080997 2.13818
H  -4.178117 -1.636109 2.005967
H  -4.247594 -0.740479 -2.540674
