program: Gaussian 09
title: 000210852
version: EM64L-G09RevD.01
frameworkgroup: C1[X(C9H8I3NO2)]
method: RPBEPBE
basis: SDD
operation: Freq
keyword: #p
keyword: freq=noraman
keyword: PBEPBE/SDD
title: #p freq=noraman PBEPBE/SDD
converged: YES YES NO NO
title: Mulliken charges:
elementType: I I I O O N C C C C C C C C C H H H H H H H H
charge: 0.098742 0.116910 0.113076 -0.396166 -0.213977 -0.683728 -0.355493 0.818375 -0.793083 -0.665633 -0.586285 0.864135 0.152652 -0.095470 -0.609367 0.242043 0.228699 0.235898 0.250478 0.270125 0.314243 0.312062 0.381765
chargesum: 0.00000
title: Mulliken charges with hydrogens summed into heavy atoms:
elementType: I I I O O N C C C C C C C C C
charge: 0.098742 0.116910 0.113076 -0.014401 -0.213977 -0.057423 -0.113450 0.818375 -0.793083 0.049442 -0.586285 0.864135 0.152652 0.174655 -0.609367
polarizability: 2.55415133e+02 5.70615676e+00 2.31443183e+02 6.89397966e+00 -8.64212863e-01 8.37145630e+01
1716.lowfreq: -4.2647 -0.0004 -0.0004 -0.0003 2.7936 6.0155 29.8029 55.1881 68.7509
frequency: 29.7879 55.1855 68.7502 82.0949 89.1094 96.5815 104.6635 129.8697 157.5897 158.8096 184.8420 191.9412 263.9640 268.4693 293.9493 316.3317 346.4692 358.4740 436.7862 453.8222 483.0301 484.5747 505.6224 542.2890 597.5121 607.8429 629.6734 665.4851 697.3479 748.1541 772.8729 808.2053 880.6432 939.4717 994.7336 1006.8816 1030.0418 1049.1255 1106.3386 1118.8627 1221.8251 1263.9385 1274.8272 1285.4186 1304.8355 1350.5048 1373.4092 1394.4288 1443.6014 1464.6612 1481.1399 1522.1208 1566.6060 1628.2445 1655.5743 2969.4995 3004.5637 3103.5318 3114.1272 3181.1278 3516.1638 3517.2428 3657.3606
redmass: 10.1570 6.4733 5.9570 14.8465 34.9961 8.4893 34.6795 5.0110 15.4453 7.1993 1.6746 1.7326 4.9410 7.5749 5.0736 5.3375 5.2846 5.6716 1.1459 3.8212 2.2458 1.6101 3.6395 3.0095 2.7340 8.9803 1.8977 8.1453 6.3510 3.9000 8.5134 3.4042 1.3865 3.0494 5.7650 2.1009 2.4022 1.6066 1.8132 2.5936 2.1948 1.4188 1.7733 2.3657 2.3197 3.4416 3.0242 1.2881 4.6330 1.0460 1.0633 7.5843 4.6156 1.3407 8.9233 1.0786 1.0353 1.1006 1.0999 1.0931 1.0457 1.0640 1.1036
irintensity: 0.0074 0.0374 0.5441 1.1063 0.1985 0.7552 0.1789 1.3590 0.1551 0.3425 0.0581 0.4489 2.9631 2.9476 4.7385 2.3427 3.2816 3.3245 0.7824 27.7242 43.3859 228.5907 0.0778 12.4702 43.5405 30.6433 53.9256 12.1981 88.0103 12.3798 17.9956 14.1884 9.8962 4.2829 17.5640 52.9477 127.1385 97.0780 17.3129 74.4093 11.8372 2.4834 17.2406 8.1258 29.3257 19.8346 11.1314 26.2904 166.4237 7.7269 8.0168 21.8386 3.4112 300.3210 234.4480 23.1968 20.6850 12.1576 10.4494 0.0386 60.8536 28.1780 63.2124
temp: 298.150 k
press: 1.00000 atm
elementType: 53 53 53 8 8 7 6 6 6 6 6 6 6 6 6 1 1 1 1 1 1 1 1
symmnumber: 1
zpe: 401053.8 jmol-1
zpe.correction: 0.152753 hartree
zpe.thermalcorrener: 0.169436 hartree
zpe.thermalcorrenthalpy: 0.170381 hartree
zpe.thermalcorrgfe: 0.104385 hartree
zpe.sumelectzpe: -586.382636 hartree
zpe.sumelectthermal: -586.365953 hartree
zpe.sumelectthermalent: -586.365009 hartree
zpe.sumelectthermalfe: -586.431004 hartree
dipole: 2.7062 1.8812 0.3516
dipole: 3.3145
quadrupole: -133.1621 -121.7138 -130.6430
quadrupole: 2.7912 -2.1067 -1.5878
quadrupole: -4.6558 6.7925 -2.1367 2.7912 -2.1067 -1.5878
hfenergy: -586.5353895 hartree
pointgroup: C01 [X(C9H8I3N1O2)]
dipole: 1.0919301 0.7012331 0.1284132 debye
dipolederiv: -0.1021384 0.049928 -0.004801 0.0653328 -0.5157737 0.0490631 -0.0130213 0.052409 0.0095285 -0.2114463 -0.1934619 -0.0033091 -0.2125679 -0.3155727 -0.0125235 0.0025127 0.0050212 0.0211533 -0.4752437 0.1511591 -0.0548792 0.1718449 -0.1220301 0.0258068 -0.05659 0.0226723 0.0170555 -0.3827077 0.0520976 -0.2445613 0.0947302 -0.3591526 -0.003148 -0.1638209 -0.0320268 -1.1272018 -1.1432911 0.0019702 -0.1674464 -0.0993874 -0.31639 -0.0120373 0.1361801 0.0207921 -0.5832006 -0.9810015 -0.586014 0.0128338 -0.6101758 -0.7429757 -0.0427953 0.0186421 -0.0392496 -0.6470896 -0.0991366 -0.094534 0.1006866 -0.3281243 0.0222512 0.1173587 0.04439 0.0686208 -0.0622499 0.0392467 0.0218976 -0.0270051 -0.2401886 -0.1884122 0.0031855 0.0055616 0.0429676 0.0399772 -0.1666531 -0.5562643 0.0565272 -0.0056307 0.9420921 -0.0901043 0.0141409 -0.1487603 -0.2126246 -0.1000137 0.0220056 -0.0302791 0.0837274 0.0255685 0.0244697 0.0377534 -0.0233911 0.0230189 0.1948293 0.5616097 -0.0002231 0.5696428 0.3856059 0.012518 -0.019926 -0.0039791 -0.206125 0.4486619 0.8862822 -0.0451241 0.8887253 0.1812511 0.0822913 -0.0464724 0.0853699 0.2241997 1.4011401 0.0626877 0.1792291 0.2038991 0.3306272 -0.0921412 -0.116675 -0.0557705 1.3684744 -0.1660299 -0.1600663 -0.0056288 0.1035557 -0.2269228 0.0234667 -0.0217543 0.0044087 0.0108353 0.8357724 -0.286119 0.1146382 -0.7968868 0.0430891 -0.087395 0.1511045 -0.0465218 -0.2178032 0.1093743 0.0212118 0.0027922 0.1204473 0.0254369 -0.0661944 0.0116756 -0.0254761 0.040553 0.0474478 -0.0775838 0.106144 -0.0514468 0.0278229 0.080511 0.0766162 0.0393825 -0.0195718 0.1054241 0.0129442 -0.0000165 -0.0136434 -0.0646093 -0.0859349 0.025499 -0.0248014 0.0711836 -0.0979341 0.0763053 -0.062735 0.0619057 0.0747308 -0.0057792 -0.05597 -0.0015719 0.0869741 0.1062055 0.0223908 -0.0064703 0.0328307 -0.0014062 0.0121234 -0.0058214 0.0125405 0.1462103 0.235879 0.0334113 -0.0135695 0.020027 0.2604959 0.0077489 -0.0138272 0.010428 0.357283 0.2832374 0.030525 -0.007821 0.0238992 0.2149612 0.010807 -0.0078625 0.0094373 0.3563754 0.1183777 -0.0523828 0.1010186 -0.0825164 0.3193123 0.048703 -0.0023353 0.0274989 0.3030442 unknown
polarizability: 255.0735069|5.6451804|229.929697|13.3228303|-12.2795091|85.5696748 unknown
InChI: InChI=1S/C9H8I3NO2/c1-3(9(14)15)6-4(10)2-5(11)8(13)7(6)12/h2-3,14H,13H2,1H3
charge 0 multiplicity 1
23 atoms
I  0.401842 3.166177 -0.39189
I  -1.467847 -2.849377 -0.126444
I  4.396471 -1.496118 0.313534
O  -2.186342 0.058959 1.915669
O  -3.987137 -0.083257 0.458115
N  3.173553 1.552201 -0.016558
C  -1.765117 0.595141 -0.409993
C  -0.329271 0.110651 -0.207546
C  0.761132 1.025006 -0.185132
C  -2.282054 0.359108 -1.850278
C  0.006182 -1.270017 -0.096912
C  2.137307 0.639799 -0.040289
C  -2.767771 0.114302 0.642886
C  1.340298 -1.70037 0.050046
C  2.381663 -0.763603 0.079773
H  -1.765896 1.693444 -0.250345
H  -1.651465 0.912996 -2.56698
H  -2.266374 -0.709195 -2.119719
H  -3.322313 0.71492 -1.936721
H  1.56588 -2.764374 0.141509
H  4.133227 1.228859 0.090222
H  2.990458 2.550382 -0.091616
H  -2.88083 -0.202633 2.579367
