program: Gaussian 09
title: 000210851
version: EM64L-G09RevD.01
frameworkgroup: C1[X(C13H12I3NO3)]
method: RPBEPBE
basis: SDD
operation: Freq
keyword: #p
keyword: freq=noraman
keyword: PBEPBE/SDD
title: #p freq=noraman PBEPBE/SDD
converged: YES YES NO NO
title: Mulliken charges:
elementType: I I I O O O N C C C C C C C C C C C C C H H H H H H H H H H H H
charge: 0.125753 0.142027 0.144694 -0.218062 -0.400985 -0.210142 -0.317741 -0.385808 -0.434330 -0.509901 0.180968 0.792038 0.802186 -0.736245 -0.355247 -0.527909 -0.577146 -0.105561 -0.663573 0.151902 0.250154 0.244092 0.241230 0.232260 0.257918 0.248032 0.246569 0.277805 0.238331 0.232797 0.251299 0.382596
chargesum: 0.00000
title: Mulliken charges with hydrogens summed into heavy atoms:
elementType: I I I O O O N C C C C C C C C C C C C C
charge: 0.125753 0.142027 0.144694 -0.218062 -0.018390 -0.210142 -0.317741 0.108437 0.039160 -0.003952 0.180968 0.792038 0.802186 -0.736245 -0.108678 -0.527909 -0.577146 0.172244 0.058854 0.151902
polarizability: 3.10557290e+02 -2.94431537e+00 2.55755739e+02 6.92230038e+00 3.10687493e+00 1.35378983e+02
1716.lowfreq: -7.8725 -6.3645 0.0000 0.0003 0.0003 1.6569 23.1282 23.9554 36.2046
frequency: 22.9563 23.7694 36.0718 53.6890 54.6813 77.8739 83.5455 88.6516 101.1466 111.5773 138.0080 141.9675 155.5747 159.9509 173.2547 181.9921 185.5515 202.2687 265.4307 305.4984 308.8276 335.0962 369.6710 435.1191 457.1152 487.8023 509.8047 522.3753 531.5565 573.9436 605.8153 624.1358 630.5074 652.4169 678.5162 697.9213 722.3619 759.7914 783.1681 829.8297 859.6846 878.4992 892.4607 928.8269 963.3232 1005.6075 1011.9976 1029.2082 1033.2561 1072.5885 1088.3423 1118.3686 1125.2108 1158.2767 1193.0855 1211.0404 1216.7051 1219.5321 1246.7993 1264.2246 1278.9648 1280.9044 1299.1715 1319.5122 1323.1657 1352.7548 1369.0561 1396.0936 1414.2706 1448.3897 1466.4558 1474.8850 1479.3642 1493.4270 1514.1648 1541.1935 1654.1035 1657.6526 2963.5352 2974.2982 3004.4961 3005.2268 3022.1385 3052.7937 3090.2781 3102.1740 3105.0669 3111.9290 3186.1174 3514.5033
redmass: 7.1236 7.8913 8.0964 4.2588 6.1251 13.6640 12.3262 21.9595 29.9236 7.5376 3.3359 4.3387 5.5331 63.3968 1.6029 2.2309 2.0116 3.5702 5.0108 5.9718 5.6321 6.4183 8.4335 6.3830 5.1456 3.7281 4.5638 3.1656 4.6630 3.4158 3.3827 4.1096 1.8460 4.8229 6.6382 6.4004 4.0410 5.9536 4.2496 2.2115 2.6563 1.4101 1.4347 2.5758 3.4998 1.9914 6.4432 2.1374 2.5140 1.7220 2.1246 2.3307 3.6675 1.2597 1.6279 2.2660 1.4019 2.6869 2.2909 1.4515 1.9184 1.6139 2.3287 1.4751 2.8926 2.1364 2.0843 1.2119 4.1147 1.0899 1.0443 1.0905 1.0620 1.0937 9.3129 9.1902 11.9926 9.1190 1.0787 1.0646 1.0352 1.0664 1.0640 1.0982 1.0992 1.1014 1.1009 1.1002 1.0931 1.0641
irintensity: 1.1218 0.7473 1.3595 1.8795 0.0609 1.1433 1.5920 0.5180 0.0819 0.8997 1.5540 1.1002 0.4180 0.0060 0.2086 0.7752 0.8030 0.2903 1.4794 4.8705 1.1652 3.1031 1.9980 9.3082 20.0340 27.5660 3.4954 8.3860 9.9252 7.2651 35.0025 14.8541 61.4638 1.1879 3.0928 86.8917 8.6326 3.5350 22.4666 23.4837 8.6463 10.8548 2.7838 15.7245 10.7668 45.8798 39.2183 68.7130 59.4387 6.9360 33.7248 62.1415 13.3761 4.5537 41.3138 53.3193 7.1980 27.7442 42.9879 4.7792 17.1442 17.7845 50.9339 4.9231 22.7952 24.6408 30.4279 33.5020 239.8722 6.4661 9.7460 13.5374 8.3961 3.4791 38.2844 19.4658 256.8422 283.4451 33.5639 42.7464 16.4567 14.0582 26.9826 17.9415 17.6220 20.6605 9.7341 10.6430 0.2316 30.0720
temp: 298.150 k
press: 1.00000 atm
elementType: 53 53 53 8 8 8 7 6 6 6 6 6 6 6 6 6 6 6 6 6 1 1 1 1 1 1 1 1 1 1 1 1
symmnumber: 1
zpe: 589115.1 jmol-1
zpe.correction: 0.224382 hartree
zpe.thermalcorrener: 0.245662 hartree
zpe.thermalcorrenthalpy: 0.246606 hartree
zpe.thermalcorrgfe: 0.168804 hartree
zpe.sumelectzpe: -816.069959 hartree
zpe.sumelectthermal: -816.048679 hartree
zpe.sumelectthermalent: -816.047735 hartree
zpe.sumelectthermalfe: -816.125537 hartree
dipole: -2.2293 0.0348 -4.2324
dipole: 4.7837
quadrupole: -153.5700 -152.4351 -164.3543
quadrupole: -6.9083 8.6623 -2.5251
quadrupole: 3.2164 4.3514 -7.5679 -6.9083 8.6623 -2.5251
hfenergy: -816.2943411 hartree
pointgroup: C01 [X(C13H12I3N1O3)]
dipole: 0.7722214 0.3358297 1.6831764 debye
polarizability: 308.5351535|8.9498246|252.5339944|16.3989192|-20.9353792|140.6228639 unknown
InChI: InChI=1S/C13H12I3NO3/c1-6(13(19)20)10-7(14)5-8(15)12(11(10)16)17-4-2-3-9(17)18/h5-6,19H,2-4H2,1H3
charge 0 multiplicity 1
32 atoms
I  0.255035 2.615411 -0.374685
I  2.413331 -3.010877 0.787466
I  -3.530462 -2.403452 -0.038527
O  2.779825 0.175765 -2.064596
O  -3.387326 0.726764 1.786478
O  -5.030687 1.069388 0.182339
N  2.306475 0.233878 0.254817
C  2.944069 0.670725 1.524402
C  4.444347 0.785328 1.133709
C  4.420612 1.071901 -0.387704
C  3.111722 0.441376 -0.882771
C  0.988519 -0.3052 0.195484
C  -1.481016 0.003111 -0.158879
C  -0.149258 0.509022 -0.075728
C  -2.654825 0.913101 -0.515693
C  0.768607 -1.692431 0.39374
C  -1.620601 -1.400162 0.046291
C  -0.524513 -2.241284 0.32397
C  -3.113735 0.750571 -1.985844
C  -3.830675 0.872042 0.464179
H  2.768874 -0.071961 2.322233
H  2.523684 1.643286 1.84905
H  4.94732 -0.178578 1.326244
H  4.958866 1.567292 1.715334
H  5.27549 0.651361 -0.939731
H  4.379742 2.156498 -0.606931
H  -2.294165 1.957896 -0.41277
H  -0.674987 -3.311352 0.475254
H  -2.284681 1.015285 -2.664325
H  -3.431921 -0.281563 -2.204867
H  -3.968474 1.418362 -2.184506
H  -4.171091 0.767099 2.39917
