program: Gaussian 09
title: 000210836
version: EM64L-G09RevD.01
frameworkgroup: C1[X(C11H16N2O)]
method: RPBEPBE
basis: SDD
operation: Freq
keyword: #p
keyword: freq=noraman
keyword: PBEPBE/SDD
title: #p freq=noraman PBEPBE/SDD
converged: YES YES NO NO
title: Mulliken charges:
elementType: O N N C C C C C C C C C C C H H H H H H H H H H H H H H H H
charge: -0.310527 -0.377998 -0.649669 -0.549173 0.503339 -0.373536 -0.636715 -0.577621 0.463006 0.462564 -0.549147 -0.817674 -0.816633 0.273693 0.210267 0.226027 0.262198 0.218012 0.255046 0.239693 0.235624 0.235943 0.223996 0.223744 0.224403 0.236213 0.223108 0.304091 0.300257 0.337469
chargesum: 0.00000
title: Mulliken charges with hydrogens summed into heavy atoms:
elementType: O N N C C C C C C C C C C C
charge: -0.310527 -0.073907 -0.011943 -0.112879 0.503339 0.106675 -0.381669 -0.337927 0.463006 0.462564 -0.313523 -0.133991 -0.132910 0.273693
polarizability: 1.64361610e+02 1.86092354e+00 1.48110259e+02 2.09720743e+01 -3.06713866e+00 9.31085812e+01
1716.lowfreq: -1.7986 -0.0002 0.0006 0.0009 8.1770 12.5795 19.0186 26.7395 32.6226
frequency: 18.9445 26.1044 32.5761 44.4379 66.7839 84.8988 114.9075 189.1319 218.4592 227.8522 252.7370 268.5147 288.6528 323.4160 411.9742 450.3502 463.9623 474.7827 503.3418 506.6783 524.5150 543.1062 553.6602 606.1680 626.3195 714.0228 716.1224 806.6261 868.8418 890.9758 904.7223 910.7722 927.3321 954.9555 979.4088 988.7334 1018.0141 1023.1280 1031.6494 1044.8322 1050.0363 1056.4805 1134.9946 1173.2164 1177.2657 1191.4042 1240.6986 1295.1373 1302.0671 1315.6143 1328.3326 1367.0414 1376.5855 1396.6034 1398.3720 1432.2803 1446.1767 1454.8015 1468.4356 1471.6669 1473.9565 1480.8140 1486.8705 1505.7424 1599.8926 1610.8039 1612.6413 1649.9335 2974.1689 2974.7526 2988.5804 2992.3067 3054.0055 3055.5031 3057.2308 3078.7142 3081.6372 3083.2748 3105.4521 3108.9168 3116.4578 3539.9170 3548.1046 3702.4257
redmass: 5.3368 1.3675 2.2063 4.0435 1.0129 4.2608 3.7998 3.2329 3.2696 3.3249 2.4456 2.7526 1.3051 1.9831 2.9929 2.2953 1.3729 1.9897 4.4280 4.6554 2.9999 1.2854 4.0809 2.8757 3.9953 4.3223 2.8930 1.9946 1.4647 3.1348 1.3246 1.5055 2.4871 2.3168 1.9161 6.1217 1.5018 1.8752 1.9231 1.5345 1.5928 2.1244 2.7216 1.4395 1.4507 1.3034 1.2979 1.3513 1.7958 1.6602 2.2600 1.5320 5.1368 1.2376 1.2413 2.1145 2.2106 1.1112 1.1138 1.0510 1.0554 1.2305 1.3041 2.1412 1.3072 5.7184 5.9525 3.7489 1.0381 1.0378 1.0651 1.0617 1.0967 1.0952 1.1003 1.0989 1.0993 1.0998 1.0910 1.0913 1.0920 1.0576 1.0644 1.1037
irintensity: 3.3631 1.1029 2.3583 8.1441 0.5173 5.1939 12.2603 3.5450 0.0701 0.5219 9.6785 2.1366 11.2440 10.1955 13.1036 0.2068 265.8273 86.9520 2.6153 1.4310 1.2926 91.6737 2.7438 5.3665 3.7483 4.5251 30.2542 12.2488 24.3640 4.2494 0.6704 2.6687 0.5476 4.0602 3.0211 0.3944 0.7201 6.3067 7.4833 3.7410 26.0793 10.4063 27.4416 0.5458 0.8724 2.2407 5.6408 0.8984 9.1500 190.8595 1.2283 19.1986 1.5580 16.6510 9.3363 1.4381 0.9632 33.9572 10.6900 10.4192 12.7583 12.8051 40.6772 400.7882 110.2305 31.7776 28.5304 290.6830 48.1937 23.2076 34.7435 34.7891 18.9969 24.5614 23.0423 5.4371 17.3195 17.0056 26.9299 22.9969 5.6244 37.7472 9.8881 36.0808
temp: 298.150 k
press: 1.00000 atm
elementType: 8 7 7 6 6 6 6 6 6 6 6 6 6 6 1 1 1 1 1 1 1 1 1 1 1 1 1 1 1 1
symmnumber: 1
zpe: 661306.0 jmol-1
zpe.correction: 0.251878 hartree
zpe.thermalcorrener: 0.267376 hartree
zpe.thermalcorrenthalpy: 0.268320 hartree
zpe.thermalcorrgfe: 0.206163 hartree
zpe.sumelectzpe: -612.476608 hartree
zpe.sumelectthermal: -612.461111 hartree
zpe.sumelectthermalent: -612.460166 hartree
zpe.sumelectthermalfe: -612.522323 hartree
dipole: -3.5910 2.0348 -2.3373
dipole: 4.7433
quadrupole: -97.6495 -73.6555 -83.8769
quadrupole: 9.6240 -4.7227 -3.1105
quadrupole: -12.5889 11.4052 1.1837 9.6240 -4.7227 -3.1105
hfenergy: -612.7284865 hartree
pointgroup: C01 [X(C11H16N2O1)]
dipole: -1.4095976 0.8607593 -0.8687289 debye
polarizability: 165.6345817|0.9453323|148.0795345|18.7337622|-3.2023835|91.8663335 unknown
InChI: InChI=1S/C11H16N2O/c1-8-5-9(2)7-10(6-8)3-4-13-11(12)14/h5-7,13H,3-4,12H2,1-2H3
charge 0 multiplicity 1
30 atoms
O  4.339482 -0.549125 0.147645
N  2.164239 -0.413887 -0.723171
N  3.746475 1.263313 -1.19637
C  0.718348 -1.328715 1.130697
C  -0.532953 -0.589524 0.67926
C  1.694141 -1.626988 -0.047699
C  -0.611387 0.824831 0.767469
C  -1.62104 -1.294916 0.107276
C  -1.747709 1.531533 0.299766
C  -2.771727 -0.618525 -0.369463
C  -2.815426 0.794544 -0.272452
C  -1.832405 3.044072 0.4265
C  -3.9449 -1.394414 -0.945496
C  3.464923 0.058181 -0.545255
H  0.446225 -2.297643 1.592661
H  1.265343 -0.740732 1.890316
H  2.592402 -2.142383 0.333258
H  1.194729 -2.288722 -0.781949
H  0.219656 1.379424 1.222378
H  -1.5742 -2.390218 0.037362
H  -3.699978 1.330414 -0.642294
H  -2.53566 3.336903 1.229848
H  -0.850663 3.486072 0.670142
H  -2.195684 3.510545 -0.507655
H  -3.611242 -2.315737 -1.455117
H  -4.649448 -1.698919 -0.147004
H  -4.515013 -0.788589 -1.67175
H  1.462292 0.17233 -1.177997
H  3.096977 1.732062 -1.824031
H  4.691101 1.62481 -1.097973
