program: Gaussian 09
title: 000210834
version: EM64L-G09RevD.01
frameworkgroup: C1[X(C16H12O3)]
method: RPBEPBE
basis: SDD
operation: Freq
keyword: #pfreq=noraman
keyword: PBEPBE/SDD
title: #p freq=noraman PBEPBE/SDD
converged: YES YES NO NO
title: Mulliken charges:
elementType: O O O C C C C C C C C C C C C C C C C H H H H H H H H H H H H
charge: -0.260974 -0.242013 -0.197555 0.224301 -0.334821 -0.450859 0.078974 0.456127 0.195614 0.199477 -0.334737 -0.391936 -0.346582 -0.348929 -0.244429 -0.236906 -0.254001 -0.199652 -0.234782 0.227589 0.239378 0.241824 0.288161 0.229875 0.277884 0.257398 0.231169 0.227597 0.237218 0.235876 0.229715
chargesum: 0.00000
title: Mulliken charges with hydrogens summed into heavy atoms:
elementType: O O O C C C C C C C C C C C C C C C C
charge: -0.260974 -0.242013 -0.197555 0.224301 -0.107232 0.030343 0.078974 0.456127 0.195614 0.199477 -0.046576 -0.162062 -0.068698 -0.091531 -0.013260 -0.009309 -0.016784 0.036224 -0.005066
polarizability: 2.18663352e+02 3.66479257e+00 1.64174824e+02 1.59195719e+01 1.14271961e+01 1.50878916e+02
1716.lowfreq: -5.3743 -0.0008 -0.0003 0.0004 5.3580 9.6350 27.2951 37.9601 71.3134
frequency: 27.1741 37.9089 71.2603 83.1168 134.1132 154.7348 181.4164 241.2129 258.9846 280.7082 297.1551 347.7488 373.0228 391.0463 404.4598 437.4302 451.0031 504.1409 512.2639 527.1323 546.0609 606.1642 614.1374 636.8491 673.2622 689.5079 700.5356 744.6588 764.8428 770.4949 784.9595 797.2355 830.5751 852.2870 860.8290 881.2594 923.1017 931.4812 973.2714 975.3080 977.4805 989.2401 996.4194 997.6617 1006.0201 1027.6663 1029.2110 1044.3844 1084.5098 1096.5009 1160.9633 1172.4024 1174.4574 1189.1873 1191.2343 1211.5663 1225.2131 1234.2283 1278.3639 1316.4119 1327.1858 1354.9691 1372.4379 1391.4845 1394.2775 1443.8927 1444.6572 1458.3985 1470.6967 1487.0465 1569.8237 1587.1937 1591.1481 1615.3565 1619.0540 2991.0263 3052.7513 3106.8998 3114.7827 3130.4841 3138.4136 3144.9903 3150.7887 3161.5738 3166.0950 3176.3813 3181.2874
redmass: 5.5756 4.5691 4.9616 5.9258 5.1865 5.3871 5.6006 5.2986 5.9374 4.0708 4.2916 4.6362 5.6644 7.4641 2.8359 3.7129 7.8045 5.4780 4.1191 3.6165 5.4542 5.8237 6.4683 7.4248 5.5305 4.4775 1.8421 3.2508 1.9049 2.5440 2.2175 4.8458 4.0708 1.2500 5.8385 1.5360 1.5214 5.1534 1.4112 2.6326 1.9992 5.3220 1.3392 1.3485 2.0621 2.0000 2.0321 1.5226 1.6396 2.0727 1.2897 1.3977 1.1175 2.3188 1.1162 2.6009 1.7557 2.2012 1.6355 1.8351 1.6620 1.4408 2.7221 4.6742 6.4917 2.2893 2.2648 2.3324 1.1777 2.3895 7.4167 9.4809 6.0886 5.9321 7.2887 1.0667 1.0883 1.0990 1.0877 1.0873 1.0863 1.0931 1.0900 1.0989 1.0952 1.0999 1.0962
irintensity: 0.3694 0.7467 0.5560 1.3132 3.4208 2.6742 2.5946 0.6586 2.6828 2.1877 7.2473 0.7951 0.8892 2.3837 0.1481 3.7590 0.2015 15.7878 12.9094 2.3274 1.1062 8.2123 0.1048 20.8534 10.8980 7.4811 57.4182 45.6827 65.3391 14.2888 41.1804 9.5402 3.6392 1.9570 51.1479 4.3681 3.9367 1.3385 5.1469 33.9016 32.8786 0.0504 0.0495 0.6840 14.1868 5.3919 6.9904 2.9997 7.8640 34.7067 21.3028 1.7784 0.3914 9.8216 4.6857 58.4158 17.2116 32.1970 68.3173 38.9095 27.1759 25.8906 41.8896 9.1928 6.5568 54.4540 45.6336 19.3355 42.9290 6.9394 21.2907 158.1314 3.9275 0.3071 78.4416 41.5091 17.0368 12.5412 7.6198 2.3205 4.2566 28.5887 3.3955 27.8101 11.4030 17.5404 4.8095
temp: 298.150 k
press: 1.00000 atm
elementType: 8 8 8 6 6 6 6 6 6 6 6 6 6 6 6 6 6 6 6 1 1 1 1 1 1 1 1 1 1 1 1
symmnumber: 1
zpe: 617985.3 jmol-1
zpe.correction: 0.235378 hartree
zpe.thermalcorrener: 0.250204 hartree
zpe.thermalcorrenthalpy: 0.251148 hartree
zpe.thermalcorrgfe: 0.192397 hartree
zpe.sumelectzpe: -841.207115 hartree
zpe.sumelectthermal: -841.192289 hartree
zpe.sumelectthermalent: -841.191345 hartree
zpe.sumelectthermalfe: -841.250096 hartree
dipole: 1.7174 -0.5869 2.8871
dipole: 3.4102
quadrupole: -96.7687 -102.9660 -110.5962
quadrupole: 1.4976 -2.5074 2.8145
quadrupole: 6.6749 0.4777 -7.1526 1.4976 -2.5074 2.8145
hfenergy: -841.4424932 hartree
pointgroup: C01 [X(C16H12O3)]
dipole: 0.7305168 -0.3478287 1.0702546 debye
polarizability: 219.870066|3.4347621|161.4660208|13.0533028|12.8043944|152.3810056 unknown
InChI: InChI=1S/C16H12O3/c17-14-12-8-4-5-9-13(12)18-10-16(14)15(19-16)11-6-2-1-3-7-11/h1-9,15H,10H2
charge 0 multiplicity 1
31 atoms
O  -1.107618 2.290508 -0.878336
O  2.115291 1.591135 1.034255
O  -0.090763 -0.202082 -2.093714
C  0.049645 1.507426 -0.345403
C  -1.291731 1.494411 0.390716
C  1.174563 2.376841 0.197534
C  0.547577 0.307378 -1.128773
C  -2.286075 0.383026 0.403302
C  1.838855 -0.236684 -0.623772
C  2.539564 0.386407 0.453198
C  -2.8429 -0.147409 -0.788394
C  -2.711107 -0.122681 1.660484
C  2.358157 -1.444196 -1.167722
C  3.706255 -0.200453 0.993659
C  -3.804794 -1.177833 -0.716438
C  -3.664989 -1.160234 1.727153
C  3.524594 -2.025495 -0.645654
C  4.191423 -1.402766 0.44449
C  -4.215567 -1.690166 0.536484
H  -1.296745 2.12286 1.295863
H  1.746676 2.826987 -0.639005
H  0.79229 3.174672 0.852338
H  -2.516062 0.254064 -1.751332
H  -2.294093 0.295165 2.585824
H  1.804017 -1.906469 -1.991592
H  4.21617 0.3003 1.821865
H  -4.234212 -1.58108 -1.639998
H  -3.984112 -1.54761 2.70104
H  3.915271 -2.956164 -1.068655
H  5.098846 -1.854936 0.85969
H  -4.962625 -2.490325 0.586194
