program: Gaussian 09
title: 000216212
version: EM64L-G09RevD.01
frameworkgroup: C1[X(C14H17NO5)]
method: RPBEPBE
basis: SDD
operation: Freq
keyword: #p
keyword: freq=noraman
keyword: PBEPBE/SDD
title: #p freq=noraman PBEPBE/SDD
converged: YES YES NO NO
title: Mulliken charges:
elementType: O O O O O N C C C C C C C C C C C C C C H H H H H H H H H H H H H H H H H
charge: -0.269769 -0.261147 -0.325077 -0.212689 -0.297026 -0.648284 -0.036979 -0.459156 -0.471992 -0.292927 -0.349180 0.231763 -0.373017 0.320150 0.090663 -0.337730 -0.327638 -0.234034 -0.243902 0.144283 0.258712 0.230657 0.240959 0.238999 0.225511 0.226555 0.204968 0.235790 0.267111 0.246462 0.251222 0.241996 0.287916 0.229540 0.234164 0.322453 0.410671
chargesum: 0.00000
title: Mulliken charges with hydrogens summed into heavy atoms:
elementType: O O O O O N C C C C C C C C C C C C C C
charge: -0.269769 -0.261147 -0.325077 -0.212689 -0.297026 0.084840 0.221733 0.012459 -0.007482 0.138596 0.153721 0.231763 0.124667 0.320150 0.090663 -0.095734 -0.039722 -0.004493 -0.009738 0.144283
polarizability: 2.40353503e+02 -4.18017443e+00 1.83047387e+02 -1.10665481e+01 -2.10056412e+00 9.99998473e+01
1716.lowfreq: -21.5091 -4.4305 0.0001 0.0003 0.0004 2.9922 8.9091 17.1544 20.8397
frequency: -15.6868 16.7351 20.5078 46.3974 51.7398 59.6397 82.5087 89.7181 113.1760 139.9321 184.1310 185.6459 221.0826 247.0685 258.0121 280.9637 288.0915 369.0653 383.0272 408.7022 427.1838 470.4375 516.9545 550.0426 565.1394 572.3054 586.6875 595.2407 613.6356 661.3991 680.7500 691.7811 722.9892 748.8043 759.4223 774.7800 801.4757 817.7685 830.6258 859.4932 864.0555 868.0359 889.8423 916.1309 931.4404 963.4460 990.1131 996.1328 1004.4405 1006.3468 1026.9137 1029.0083 1040.8828 1075.5834 1085.6140 1087.8422 1129.8483 1139.2326 1148.7150 1150.4148 1171.8198 1173.7748 1191.6593 1218.2449 1220.2855 1237.9977 1269.5606 1270.9352 1300.5254 1312.9684 1330.8244 1340.5442 1351.5196 1359.6565 1371.1128 1388.5105 1435.5966 1447.9468 1451.8764 1465.5021 1472.4957 1476.0432 1490.1432 1558.7501 1590.3679 1606.3468 1623.3381 1666.7995 2971.0090 2982.5387 3013.8610 3014.6942 3029.8206 3034.2230 3046.6800 3073.2457 3080.7684 3094.8768 3127.9569 3134.3264 3148.4760 3158.7663 3171.6315 3448.8728 3637.7857
redmass: 3.1790 5.3921 5.4348 6.8571 5.6058 5.9232 4.9553 5.6235 3.1944 3.6535 7.3485 3.2937 3.3161 4.4093 3.2704 5.5049 4.3845 4.9188 6.1066 2.1507 3.1895 5.8108 3.2069 4.6070 3.7447 5.4917 1.9831 5.0656 1.4257 4.6112 5.1244 2.7677 5.0176 1.0893 2.0866 2.0192 5.5693 2.3038 2.9983 2.3008 1.4558 5.7523 1.7448 2.6211 5.5125 1.3512 1.5072 2.5638 1.4124 1.7115 4.1304 4.8946 2.5016 2.0878 3.0027 1.4760 1.5565 2.7609 1.7066 1.5326 1.6856 1.1438 1.0785 1.4426 2.8670 1.3106 1.2354 1.5314 1.3904 1.2471 1.2777 1.3208 2.1560 2.2029 1.4426 5.8318 2.4654 1.1062 1.1825 1.0854 1.0943 2.0916 1.0940 2.6129 3.2648 3.1716 4.3140 8.9437 1.0554 1.0656 1.0607 1.0673 1.1046 1.0834 1.0581 1.0990 1.1023 1.1056 1.1101 1.0857 1.0893 1.0939 1.1004 1.0513 1.0998
irintensity: 0.7005 0.1141 0.0849 0.4115 0.4234 1.7152 0.5443 5.2606 8.7044 1.9593 2.4140 6.0432 2.5164 0.7583 15.2805 13.6480 11.1155 19.6710 2.8781 5.9008 4.6284 1.0881 0.5791 2.6077 3.3829 5.8806 6.3013 4.3561 52.5507 5.5960 7.8178 91.3983 2.6647 111.9001 104.1927 28.4892 19.9806 10.7174 14.7899 2.0377 0.0992 0.6337 7.4453 11.4421 62.5674 2.9972 0.7996 36.5230 1.2327 0.9981 15.2810 166.5521 21.2896 19.7874 65.4171 6.5555 8.5847 503.5193 37.2434 55.2617 17.0818 4.9321 2.3691 64.4308 74.2173 1.5002 0.7162 11.6913 10.7599 1.7193 6.6881 8.3172 41.4467 118.1334 24.9329 3.5137 97.2101 28.0275 32.0196 8.9394 12.6124 43.0260 0.8631 95.2988 52.8731 24.2020 339.2561 179.6874 46.1810 86.0626 19.4615 15.9663 12.7385 24.7302 31.4049 29.5566 10.4264 55.6778 10.0678 3.9622 10.6194 14.9746 22.2595 172.4009 91.3854
temp: 298.150 k
press: 1.00000 atm
elementType: 8 8 8 8 8 7 6 6 6 6 6 6 6 6 6 6 6 6 6 6 1 1 1 1 1 1 1 1 1 1 1 1 1 1 1 1 1
symmnumber: 1
zpe: 771602.0 jmol-1
zpe.correction: 0.293888 hartree
zpe.thermalcorrener: 0.312202 hartree
zpe.thermalcorrenthalpy: 0.313146 hartree
zpe.thermalcorrgfe: 0.244185 hartree
zpe.sumelectzpe: -973.059580 hartree
zpe.sumelectthermal: -973.041266 hartree
zpe.sumelectthermalent: -973.040322 hartree
zpe.sumelectthermalfe: -973.109283 hartree
dipole: -6.4970 -6.6853 0.2268
dipole: 9.3250
quadrupole: -120.7124 -119.2893 -116.9172
quadrupole: -8.7141 5.0876 0.8424
quadrupole: -1.7394 -0.3163 2.0558 -8.7141 5.0876 0.8424
hfenergy: -973.3534676 hartree
pointgroup: C01 [X(C14H17N1O5)]
dipole: 2.5917747 2.0513577 1.5919719 debye
polarizability: 240.7044486|-8.450564|150.467758|3.0460475|40.8649495|132.2285305 unknown
InChI: InChI=1S/C14H17NO5/c15-14(17)11-5-1-2-6-12(11)19-9-13(16)20-8-10-4-3-7-18-10/h1-2,5-6,10H,3-4,7-9,15H2
charge 0 multiplicity 1
37 atoms
O  5.421688 -0.996679 -0.799809
O  2.27192 -0.154495 1.070632
O  -1.247866 -0.284816 0.323284
O  1.031783 -1.568177 -0.326798
O  -4.674125 -1.852569 -1.599354
N  -2.380292 -2.036243 -1.331128
C  4.207496 -0.185783 -0.509057
C  4.700513 1.258102 -0.251251
C  6.153059 1.051721 0.25445
C  6.625401 -0.143247 -0.596698
C  3.546166 -0.856055 0.710014
C  1.103581 -0.618296 0.47666
C  -0.06463 0.223968 0.986672
C  -2.507305 0.28864 0.597517
C  -3.625209 -0.281879 -0.080133
C  -2.665873 1.373079 1.49226
C  -4.900791 0.279969 0.173667
C  -3.952714 1.906806 1.721561
C  -5.075574 1.361036 1.061111
C  -3.594191 -1.44555 -1.057878
H  3.533087 -0.258631 -1.381473
H  4.702888 1.830155 -1.196397
H  4.060124 1.789222 0.473349
H  6.782234 1.946206 0.111967
H  6.160323 0.793428 1.328949
H  7.390963 -0.7692 -0.108538
H  6.998513 0.188357 -1.586261
H  4.172557 -0.763923 1.610774
H  3.332316 -1.914983 0.489286
H  0.116791 1.289954 0.743615
H  -0.136522 0.122415 2.088083
H  -1.804843 1.806202 2.010292
H  -5.743754 -0.173724 -0.358527
H  -4.070792 2.74664 2.415119
H  -6.074346 1.772979 1.236395
H  -2.383217 -2.816733 -1.986819
H  -1.507958 -1.713195 -0.901336
