program: Gaussian 09
title: 000210831
version: EM64L-G09RevD.01
frameworkgroup: C1[X(C11H10Cl2N2O2S)]
method: RPBEPBE
basis: SDD
operation: Freq
keyword: #p
keyword: freq=noraman
keyword: PBEPBE/SDD
title: #p freq=noraman PBEPBE/SDD
converged: YES YES NO NO
title: Mulliken charges:
elementType: Cl Cl S O O N N C C C C C C C C C C C H H H H H H H H H H
charge: -0.010797 -0.038924 0.314033 -0.271748 -0.256234 -0.356927 0.015737 -0.318998 -0.447394 0.201868 -0.657831 0.503955 -0.306610 -0.298249 -0.192289 -0.224368 -0.114560 -0.357080 0.262871 0.261272 0.272125 0.250993 0.352863 0.285272 0.315732 0.267484 0.284958 0.262845
chargesum: 0.00000
title: Mulliken charges with hydrogens summed into heavy atoms:
elementType: Cl Cl S O O N N C C C C C C C C C C C
charge: -0.010797 -0.038924 0.314033 -0.271748 -0.256234 -0.004064 0.015737 0.205145 0.075724 0.201868 -0.056827 0.503955 -0.306610 -0.030765 0.092669 0.038477 -0.114560 -0.357080
polarizability: 1.89788583e+02 2.28291375e+01 1.55019040e+02 4.38324291e+00 2.73679358e+00 1.69398834e+02
1716.lowfreq: -3.1930 0.0020 0.0021 0.0029 1.9472 10.2106 15.3487 18.9597 20.0493
frequency: 15.3176 18.8918 19.9853 45.2247 54.2916 67.4071 78.7166 92.3143 153.1829 163.2993 166.5886 185.7448 189.3098 249.8054 272.6721 289.7001 339.3179 366.5004 380.6096 387.1211 392.9895 427.7748 441.7482 454.6991 548.5632 558.8071 574.4119 618.0684 622.9144 635.8336 650.8468 680.1360 698.9676 704.0973 762.1902 795.5832 803.9433 860.2540 864.1174 932.9784 981.0478 1000.2058 1028.6311 1030.6778 1044.7768 1086.4506 1091.1342 1154.0154 1188.6765 1204.1166 1234.5536 1248.2609 1256.2047 1257.2115 1310.7046 1327.7934 1361.7103 1366.5762 1386.6570 1436.4893 1453.8535 1458.3490 1460.3372 1497.2890 1572.4594 1594.0231 1621.5153 2100.5620 3023.8134 3027.9243 3049.0544 3089.6675 3096.6902 3135.9778 3159.2628 3180.5400 3183.4438 3523.4947
redmass: 12.3952 12.5686 8.9857 7.4011 6.6024 6.5864 6.4761 7.3590 3.0549 6.9251 8.9065 7.2713 8.9117 4.8575 3.6621 4.7018 8.2794 6.8600 11.4887 9.8413 5.9287 5.7871 3.4351 8.0764 4.1894 4.2149 4.2359 6.6993 10.1723 2.8285 1.4759 6.1150 4.0018 4.0921 1.3397 6.7741 1.4161 3.0764 1.3946 1.3376 6.9634 2.1310 3.6266 3.7858 1.8336 2.7521 3.6242 1.3078 1.2996 1.7712 1.6186 1.8870 1.2993 1.3213 1.1221 1.2933 4.5800 1.2722 5.2832 1.0803 1.2718 1.0834 2.0544 1.9233 7.5597 7.7194 7.7589 12.7279 1.0596 1.0584 1.0569 1.1058 1.1060 1.1099 1.0886 1.0960 1.0942 1.0783
irintensity: 0.5297 0.5400 0.4118 4.1564 10.9025 2.2946 0.5287 1.1790 2.4698 0.4139 0.3610 9.1191 2.4673 2.1934 17.8268 4.1444 9.0239 2.3708 1.3945 9.7631 9.8474 2.2218 6.2856 0.9575 6.2127 6.1421 0.1625 31.5126 5.3730 34.8399 103.8533 34.4403 2.7811 31.0968 13.8348 28.5106 52.6916 3.9473 20.5466 0.4152 41.6930 7.2167 3.2829 97.4095 1.6896 45.3998 8.4700 2.0830 1.8627 68.8866 103.3526 38.7848 32.4076 29.6354 13.4034 5.2200 17.8756 7.3208 2.8351 7.2196 132.8967 34.9037 172.1048 172.4235 22.3098 5.5971 184.9315 26.0002 7.0631 18.3352 8.7891 2.4935 6.1201 3.0189 3.7953 0.2173 1.4396 44.6680
temp: 298.150 k
press: 1.00000 atm
elementType: 17 17 16 8 8 7 7 6 6 6 6 6 6 6 6 6 6 6 1 1 1 1 1 1 1 1 1 1
symmnumber: 1
zpe: 507151.3 jmol-1
zpe.correction: 0.193164 hartree
zpe.thermalcorrener: 0.211916 hartree
zpe.thermalcorrenthalpy: 0.212861 hartree
zpe.thermalcorrgfe: 0.140964 hartree
zpe.sumelectzpe: -2001.951469 hartree
zpe.sumelectthermal: -2001.932716 hartree
zpe.sumelectthermalent: -2001.931772 hartree
zpe.sumelectthermalfe: -2002.003669 hartree
dipole: 1.1574 -2.5982 -1.5245
dipole: 3.2271
quadrupole: -144.7164 -131.4670 -136.3249
quadrupole: 10.7526 4.8520 -6.7027
quadrupole: -7.2136 6.0357 1.1779 10.7526 4.8520 -6.7027
hfenergy: -2002.1446326 hartree
pointgroup: C01 [X(C11H10Cl2N2O2S1)]
dipole: 0.6373868 0.8769846 0.6607699 debye
polarizability: 183.7421653|-22.9435713|156.9094634|-10.9060856|4.9283343|173.5548284 unknown
InChI: InChI=1S/C11H10Cl2N2O2S/c12-8-1-2-10(9(13)5-8)17-6-11(16)15-3-4-18-7-14/h1-2,5,15H,3-4,6H2
charge 0 multiplicity 1
28 atoms
Cl 2.237882 1.876124 -2.786841
Cl 4.950016 -2.561396 -0.84021
S  -5.385377 -0.396332 1.098392
O  1.014083 1.957941 -0.098957
O  -1.193598 1.201196 2.735998
N  -1.411633 0.784632 0.449045
N  -5.619284 -1.502812 -1.619181
C  -2.57857 -0.097984 0.605787
C  0.417743 2.243702 1.215218
C  -0.792802 1.350168 1.542144
C  -3.854067 0.729454 0.86321
C  1.910402 0.878822 -0.193264
C  2.578438 0.719223 -1.435116
C  2.179345 -0.041637 0.849251
C  3.501097 -0.320468 -1.643093
C  3.10582 -1.090824 0.657488
C  3.754994 -1.214652 -0.583343
C  -5.501576 -1.037243 -0.519727
H  -2.405681 -0.772892 1.462471
H  -2.6878 -0.707578 -0.307548
H  0.083134 3.292405 1.142277
H  1.15585 2.165491 2.03267
H  -1.017524 0.966387 -0.47841
H  -4.079607 1.426198 0.041621
H  -3.7830 1.274606 1.818473
H  1.667302 0.037382 1.812486
H  4.007305 -0.424735 -2.605813
H  3.309207 -1.79908 1.464872
