program: Gaussian 09
title: 000216201
version: EM64L-G09RevD.01
frameworkgroup: C1[X(C11H14N2O5)]
method: RPBEPBE
basis: SDD
operation: Freq
keyword: #p
keyword: freq=noraman
keyword: PBEPBE/SDD
title: #p freq=noraman PBEPBE/SDD
converged: YES YES NO NO
title: Mulliken charges:
elementType: O O O O O N N C C C C C C C C C C C H H H H H H H H H H H H H H
charge: -0.285590 -0.434662 -0.488855 -0.414359 -0.232086 -0.639386 -0.351357 -0.221955 -0.587732 0.524423 0.242505 -0.494233 -0.480784 0.186170 -0.330588 0.126797 -0.440388 0.202651 0.267735 0.206599 0.248171 0.321885 0.226721 0.289881 0.289416 0.364000 0.217161 0.291142 0.263021 0.380568 0.369931 0.383199
chargesum: 0.00000
title: Mulliken charges with hydrogens summed into heavy atoms:
elementType: O O O O O N N C C C C C C C C C C C
charge: -0.285590 -0.054094 -0.118924 -0.031160 -0.232086 -0.060089 0.012643 0.045779 -0.132961 0.524423 0.242505 -0.172348 -0.254064 0.186170 -0.113427 0.126797 0.113775 0.202651
polarizability: 2.15387391e+02 2.44815689e+00 1.55005632e+02 -5.69778253e+00 -4.24586745e+00 8.78416418e+01
1716.lowfreq: -9.7546 -1.0245 -0.0011 -0.0011 -0.0006 2.2278 18.0073 20.4763 31.1021
frequency: 18.0044 20.4693 31.1000 37.8237 51.7286 67.4223 90.1646 160.6183 166.4786 222.0651 229.5921 254.4357 258.7571 282.9455 295.6245 328.5405 335.2476 337.9228 378.7096 435.3466 441.5525 465.7717 490.2445 494.2764 518.7529 529.4208 552.6453 567.8065 595.1484 633.2120 662.8258 693.8971 719.7908 736.8130 744.6216 766.3214 783.1449 805.9514 810.1161 849.7596 889.0725 919.0951 939.6886 949.3046 985.0779 1034.1542 1068.3047 1078.0062 1088.5759 1117.6446 1139.5006 1146.3790 1155.2668 1182.0975 1183.1566 1207.1154 1239.3673 1246.3051 1269.8735 1273.2005 1306.8444 1308.5042 1327.4759 1335.3651 1358.3249 1407.0514 1437.2407 1448.5765 1465.0829 1482.9476 1501.0938 1605.2688 1617.7282 1628.6297 1642.5218 1663.7447 2988.8575 2990.9960 3007.8185 3043.4250 3052.7327 3113.6364 3139.8177 3152.7651 3403.4743 3439.0793 3513.5560 3525.2075 3567.7591 3623.4733
redmass: 5.9244 5.6913 10.1433 5.8695 6.8519 4.5423 6.3144 4.7401 4.2509 3.7811 3.5159 1.9044 1.5156 5.0877 4.6620 3.3832 2.4160 2.0170 3.8432 3.9451 3.2386 3.4107 1.1042 2.3733 5.1290 4.6580 3.8382 5.4029 3.7381 3.2775 1.6022 3.3053 4.3079 1.7585 5.1041 3.6472 1.5842 4.4386 1.5761 1.8130 1.4529 1.7293 1.5918 2.8803 3.0179 3.0157 2.3610 2.3278 2.2271 2.4322 1.3089 1.8566 1.7827 1.3255 1.3471 1.4847 1.8451 1.1818 2.7630 1.4222 2.2989 1.3756 1.5351 1.3068 1.3703 4.8652 1.0817 1.1500 2.7306 2.3817 3.3123 7.1445 7.7012 6.5996 1.1081 9.0083 1.0597 1.0607 1.0825 1.0996 1.1028 1.0874 1.0961 1.0934 1.0773 1.0463 1.0639 1.0648 1.0968 1.0666
irintensity: 0.7289 0.1587 1.3496 0.9995 3.4160 5.4022 0.7573 1.6556 0.9254 17.8140 10.5264 78.4066 84.0527 9.5123 26.7181 1.7287 4.3261 15.0480 5.5632 8.6612 20.6736 31.5718 129.1077 29.0884 1.8815 27.4913 27.4032 6.1807 30.8123 10.7316 131.8801 98.1494 3.2281 211.4202 20.3722 36.9825 37.3151 13.4996 49.9696 78.1303 3.0865 4.1088 15.8903 23.7811 51.4406 3.1544 155.3391 211.7391 34.8044 10.5540 6.0433 3.7248 46.0928 41.0273 41.4487 23.8779 73.3696 88.8149 139.7929 13.6644 19.5630 49.6678 21.9151 1.8303 3.7071 4.1878 20.9577 16.7897 12.5432 343.4994 146.4215 75.8833 152.7372 0.5311 37.3809 305.0849 59.3526 20.2765 16.1845 4.8710 11.6693 17.1047 16.2660 24.8730 125.1288 2.2729 26.4091 78.4389 3.1045 53.6373
temp: 298.150 k
press: 1.00000 atm
elementType: 8 8 8 8 8 7 7 6 6 6 6 6 6 6 6 6 6 6 1 1 1 1 1 1 1 1 1 1 1 1 1 1
symmnumber: 1
zpe: 646433.6 jmol-1
zpe.correction: 0.246214 hartree
zpe.thermalcorrener: 0.264460 hartree
zpe.thermalcorrenthalpy: 0.265404 hartree
zpe.thermalcorrgfe: 0.196711 hartree
zpe.sumelectzpe: -911.851546 hartree
zpe.sumelectthermal: -911.833299 hartree
zpe.sumelectthermalent: -911.832355 hartree
zpe.sumelectthermalfe: -911.901048 hartree
dipole: -1.8903 6.6694 1.5209
dipole: 7.0970
quadrupole: -86.5590 -101.7635 -104.6655
quadrupole: 6.5661 -3.9994 -2.7162
quadrupole: 11.1037 -4.1008 -7.0029 6.5661 -3.9994 -2.7162
hfenergy: -912.0977591 hartree
pointgroup: C01 [X(C11H14N2O5)]
dipole: 0.821553 2.2250742 -1.4731915 debye
polarizability: 215.2346827|-5.7338873|149.7370421|-3.2925578|-18.9081474|93.2629395 unknown
InChI: InChI=1S/C11H14N2O5/c12-7(11(18)13-5-10(16)17)3-6-1-2-8(14)9(15)4-6/h1-2,4,7,13-16H,3,5,12H2
charge 0 multiplicity 1
32 atoms
O  -1.190715 -0.878629 0.845379
O  3.433271 -2.432846 0.902034
O  5.594547 -1.044816 0.088118
O  -4.91432 0.931386 0.411883
O  -6.108239 -1.051197 0.616024
N  -1.441902 1.881175 -1.533054
N  -2.774593 -0.255581 -0.752585
C  -0.609791 0.885946 -0.808301
C  0.411011 1.47948 0.230221
C  1.795312 0.841367 0.191365
C  -1.542593 -0.163755 -0.144353
C  1.975888 -0.514761 0.57471
C  2.916917 1.59407 -0.239753
C  3.253734 -1.09791 0.522679
C  4.20734 1.011484 -0.291789
C  4.369127 -0.331134 0.088187
C  -3.809882 -1.14266 -0.256829
C  -5.056985 -0.457489 0.296012
H  -0.031764 0.339079 -1.578895
H  0.509593 2.559518 0.012549
H  -0.021497 1.377791 1.24317
H  1.120995 -1.106429 0.91878
H  2.789966 2.643305 -0.530232
H  -0.952676 2.33608 -2.310127
H  -1.882161 2.571733 -0.912081
H  -2.937111 0.45789 -1.479232
H  5.070175 1.603676 -0.622794
H  -3.362959 -1.74309 0.560883
H  -4.153887 -1.856397 -1.029111
H  4.395387 -2.66324 0.809294
H  6.348904 -0.478465 -0.200669
H  -5.752493 1.306317 0.797918
