program: Gaussian 09
title: 000210830
version: EM64L-G09RevD.01
frameworkgroup: C1[X(C7H5NO2)]
method: RPBEPBE
basis: SDD
operation: Freq
keyword: #pfreq=noraman
keyword: PBEPBE/SDD
title: #p freq=noraman PBEPBE/SDD
converged: NO YES NO YES
title: Mulliken charges:
elementType: O O N C C C C C C C H H H H H
charge: -0.174190 -0.250188 -0.344506 0.046962 0.242196 0.196944 -0.319448 -0.325934 -0.231523 -0.186311 0.266558 0.257520 0.349248 0.235873 0.236798
chargesum: 0.00000
title: Mulliken charges with hydrogens summed into heavy atoms:
elementType: O O N C C C C C C C
charge: -0.174190 -0.250188 0.004742 0.046962 0.242196 0.196944 -0.052890 -0.068414 0.004350 0.050487
polarizability: 1.17788275e+02 2.47605255e+00 9.58994559e+01 -2.20272661e-03 1.13977163e-02 3.45991243e+01
1716.lowfreq: -4.0908 -0.0008 -0.0007 -0.0004 7.9896 15.4183 109.9683 176.3972 219.3132
frequency: 109.9666 176.3921 219.3130 258.6819 388.7760 416.6004 487.2064 518.7852 548.3963 569.1187 653.5966 698.4563 744.8136 753.6255 771.5900 813.8566 869.2198 956.2047 956.5882 990.5335 1008.0658 1058.8284 1107.7920 1157.5007 1195.2947 1207.7734 1286.1089 1326.1162 1408.7466 1445.0494 1463.9703 1610.3156 1623.4626 1651.1825 3142.0410 3155.9303 3171.3854 3181.4520 3610.4120
redmass: 4.9142 5.7695 2.7779 7.5960 1.5725 3.1371 6.4519 4.0953 7.3582 6.8379 5.0522 11.3892 5.7792 2.4729 1.7316 5.6635 1.3971 8.1549 1.3776 1.3182 2.0797 4.2506 1.8762 1.3292 2.4153 2.4769 1.5314 1.4834 8.5516 2.4651 2.7312 7.7710 7.9978 9.5607 1.0864 1.0908 1.0966 1.0992 1.0837
irintensity: 27.4520 10.0625 38.1118 3.3900 117.5803 2.2233 6.2323 3.9982 8.1772 2.3627 10.0618 4.2767 1.0254 47.8419 50.7987 28.3627 0.0155 21.8316 2.7832 0.0001 7.3513 3.5715 22.1662 1.7917 24.1403 12.5387 14.3051 2.3877 8.3044 53.6737 7.7376 18.7417 17.3053 393.8126 2.8889 5.3125 11.3359 9.1452 99.4048
temp: 298.150 k
press: 1.00000 atm
elementType: 8 8 7 6 6 6 6 6 6 6 1 1 1 1 1
symmnumber: 1
zpe: 279406.7 jmol-1
zpe.correction: 0.106420 hartree
zpe.thermalcorrener: 0.113974 hartree
zpe.thermalcorrenthalpy: 0.114918 hartree
zpe.thermalcorrgfe: 0.074136 hartree
zpe.sumelectzpe: -474.205432 hartree
zpe.sumelectthermal: -474.197879 hartree
zpe.sumelectthermalent: -474.196935 hartree
zpe.sumelectthermalfe: -474.237717 hartree
dipole: -2.7903 -2.2496 0.0002
dipole: 3.5842
quadrupole: -51.5478 -55.6247 -59.9294
quadrupole: -9.4304 -0.0003 -0.0009
quadrupole: 4.1528 0.0759 -4.2288 -9.4304 -0.0003 -0.0009
hfenergy: -474.3118526 hartree
pointgroup: C01 [X(C7H5N1O2)]
dipole: 1.0981405 -0.8846516 -0.0000897 debye
dipolederiv: -0.6435262 -0.0124768 0.0000162 -0.3554801 -0.6141891 -0.0000018 -0.0000514 0.0001414 -0.0441161 -0.9264772 0.4026912 0.0001026 0.4447703 -0.8311657 -0.0001383 -0.0003731 0.0003826 -0.3588468 -0.1157091 -0.4724522 0.0001934 -0.1118936 -0.3990738 0.0001447 0.0002097 -0.0000945 -0.4158239 -0.5534231 0.2361133 -0.0000504 -0.1239724 -0.1672445 0.0000125 0.0001003 0.000035 -0.0148429 0.6430653 0.2794187 -0.0000812 0.4076128 0.3124948 -0.0000153 0.0000492 -0.0000411 0.0651078 1.2926972 -0.3743724 -0.0001338 -0.4827817 1.2661675 0.0000764 0.0001038 -0.0002786 0.2506296 0.2003276 -0.1471182 -0.0000012 0.1328701 0.1012165 -0.0000488 0.0000034 -0.0000276 -0.1013103 -0.2137697 -0.2124345 0.0000345 -0.0906943 0.0090475 -0.0000172 -0.0000098 -0.0000239 -0.1590425 -0.130937 0.2134989 -0.0000533 0.1686594 -0.0937768 -0.000045 -0.0000241 -0.0000603 -0.1789525 0.1150194 0.0109454 -0.0000338 -0.052977 0.1888838 -0.0000696 0.0000026 -0.0000709 -0.1382464 0.0922209 0.0561602 -0.0000014 0.0099664 -0.0152777 0.0000318 0.0000127 0.0000186 0.1625472 0.0897084 0.0186763 0.0000069 0.0468729 -0.0372438 0.0000357 -0.0000219 0.0000094 0.1855572 0.2627637 0.0478826 -0.0000431 0.0675977 0.2005952 -0.0000257 -0.0000411 -0.0000785 0.4178838 -0.0165634 -0.094104 0.0000315 -0.0985601 -0.0070254 0.0000501 0.000017 0.0000624 0.1695724 -0.0953969 0.0475715 0.0000133 0.0380096 0.0865915 0.0000105 0.0000228 0.000026 0.1598834 unknown
polarizability: 117.790173|-2.4676471|95.8975577|-0.0021984|-0.0113986|34.5991243 unknown
InChI: InChI=1S/C7H5NO2/c9-7-5-3-1-2-4-6(5)10-8-7/h1-4,8H
charge 0 multiplicity 1
15 atoms
O  -0.874276 -1.775834 0.000509
O  -2.520445 1.441129 -0.000145
N  -2.023569 -0.875584 0.000229
C  -0.203524 0.468991 0.000195
C  0.221623 -0.876157 0.00041
C  -1.686495 0.493334 0.000515
C  0.747798 1.51033 -0.000187
C  1.571707 -1.262396 0.000363
C  2.114514 1.158052 -0.000225
C  2.514963 -0.209304 0.000051
H  0.418459 2.554087 -0.000352
H  1.873346 -2.313156 0.000512
H  -2.92501 -1.351238 -0.000212
H  2.879838 1.940604 -0.000457
H  3.58217 -0.455858 -0.000005
