program: Gaussian 09
title: 000210828
version: EM64L-G09RevD.01
frameworkgroup: C1[X(C13H11FN2)]
method: RPBEPBE
basis: SDD
operation: Freq
keyword: #p
keyword: freq=noraman
keyword: PBEPBE/SDD
title: #p freq=noraman PBEPBE/SDD
converged: YES YES NO NO
title: Mulliken charges:
elementType: F N N C C C C C C C C C C C C C H H H H H H H H H H H
charge: -0.215961 -0.141283 -0.659380 0.303420 0.132290 0.286552 -0.359435 -0.362078 -0.550026 -0.399198 -0.226390 -0.241548 -0.229483 0.356324 -0.161083 -0.408950 0.279940 0.214751 0.285244 0.253345 0.231629 0.228988 0.232297 0.229841 0.254786 0.346279 0.319128
chargesum: 0.00000
title: Mulliken charges with hydrogens summed into heavy atoms:
elementType: F N N C C C C C C C C C C C C C
charge: -0.215961 -0.141283 0.006027 0.303420 0.132290 0.286552 -0.079495 -0.147327 -0.264782 -0.145852 0.005239 -0.012560 0.002814 0.356324 0.068758 -0.154164
polarizability: 2.66923151e+02 1.00978411e+01 1.25762605e+02 4.82049288e+00 -6.49883222e+00 9.94814716e+01
1716.lowfreq: -9.1943 -4.4111 -0.0005 -0.0004 0.0007 3.5227 27.2666 43.9801 61.2463
frequency: 26.8450 43.9480 61.2390 70.7856 149.0084 179.5117 226.1131 251.0750 297.9264 328.1922 402.8271 405.1927 429.2934 437.1378 450.5526 495.9828 498.5108 536.4660 554.8537 583.8412 616.1314 646.2448 675.9471 689.2303 700.0004 725.2704 767.6021 781.1576 787.1836 854.2437 862.7283 878.4265 912.7750 933.5733 965.8968 980.9325 983.6393 990.3853 1004.9641 1024.6030 1038.8055 1071.3367 1085.2520 1123.9353 1135.2800 1166.8854 1173.2383 1190.9967 1255.6081 1277.9447 1317.1821 1360.7599 1368.8725 1387.1438 1430.2407 1437.1701 1465.7471 1489.3785 1569.9045 1582.4691 1602.2933 1613.0779 1616.8047 1639.6709 3122.0182 3132.7088 3142.4211 3146.0423 3160.5412 3163.0071 3169.7292 3171.6702 3184.3911 3537.7222 3683.2097
redmass: 4.5053 5.4043 4.8706 5.3908 5.3446 4.6397 5.4158 5.2179 4.1057 7.2523 3.4072 2.7248 4.0515 1.3710 3.0576 2.5168 7.1813 1.6262 3.3113 4.8000 6.3452 4.9086 5.1613 2.4547 1.7018 5.8930 2.7277 1.6303 2.1519 1.2559 1.5729 1.4085 4.1474 1.4393 1.3180 5.6543 1.4408 5.2043 1.3439 2.4342 1.8477 1.5434 1.6054 1.8285 2.2592 1.1875 1.0608 1.1156 3.1905 1.5821 1.3367 5.2690 4.0257 9.1186 3.4414 2.3934 2.5557 2.5605 6.2742 5.3924 3.0262 4.4699 4.9803 2.0438 1.0860 1.0875 1.0876 1.0927 1.0963 1.0922 1.0938 1.0996 1.0976 1.0456 1.1029
irintensity: 0.6593 0.0026 2.0426 4.3086 3.1001 1.5195 0.4283 1.1708 2.2278 9.8618 0.3199 3.2206 9.2672 75.7860 13.7058 111.5377 2.5508 36.3987 6.1073 5.4840 0.2802 11.1700 24.7367 18.6191 62.7616 7.1358 34.7666 40.5240 36.4715 0.5737 29.7764 0.4005 102.8798 4.3736 1.2465 4.2348 1.2716 0.0491 1.7376 10.4185 35.5459 6.8567 16.1311 7.3252 45.7490 2.6986 1.5375 8.5944 18.8920 11.0747 6.0084 31.4113 113.4805 0.2098 2.9588 14.6986 64.3482 23.3599 106.1109 192.6277 283.0046 24.8868 43.9879 300.5296 8.6614 1.9796 13.2313 27.9700 22.7263 1.5845 7.1997 17.0532 4.7907 27.3485 34.2345
temp: 298.150 k
press: 1.00000 atm
elementType: 9 7 7 6 6 6 6 6 6 6 6 6 6 6 6 6 1 1 1 1 1 1 1 1 1 1 1
symmnumber: 1
zpe: 545638.9 jmol-1
zpe.correction: 0.207823 hartree
zpe.thermalcorrener: 0.221281 hartree
zpe.thermalcorrenthalpy: 0.222226 hartree
zpe.thermalcorrgfe: 0.166218 hartree
zpe.sumelectzpe: -710.217932 hartree
zpe.sumelectthermal: -710.204473 hartree
zpe.sumelectthermalent: -710.203529 hartree
zpe.sumelectthermalfe: -710.259536 hartree
dipole: 2.8362 1.3303 -1.9906
dipole: 3.7116
quadrupole: -84.8014 -87.5872 -92.3879
quadrupole: 8.0966 6.1458 -5.5852
quadrupole: 3.4574 0.6717 -4.1290 8.0966 6.1458 -5.5852
hfenergy: -710.4257547 hartree
pointgroup: C01 [X(C13H11F1N2)]
dipole: -1.1300282 -0.7138167 0.5881075 debye
polarizability: 266.9672329|-7.6081429|98.5854716|-8.0882394|-3.6877011|126.6145229 unknown
InChI: InChI=1S/C13H11FN2/c14-11-7-4-8-12(9-11)16-13(15)10-5-2-1-3-6-10/h1-9H,15H2
charge 0 multiplicity 1
27 atoms
F  4.34881 1.250981 1.530055
N  0.131821 -0.136683 -0.54551
N  -0.356634 -0.857657 1.689836
C  -2.174543 -0.121192 0.199064
C  -0.717036 -0.368715 0.438726
C  1.535966 -0.229869 -0.399795
C  -2.55174 0.74925 -0.856449
C  -3.18781 -0.728474 0.987181
C  2.253247 0.54119 0.566457
C  2.272549 -1.038083 -1.314005
C  -3.911425 1.022242 -1.106536
C  -4.550372 -0.455776 0.734454
C  -4.91681 0.424621 -0.308779
C  3.653949 0.470127 0.575362
C  3.68035 -1.088975 -1.256057
C  4.402682 -0.330041 -0.303611
H  -1.756739 1.18995 -1.465663
H  -2.931786 -1.449722 1.772672
H  1.733705 1.208743 1.260693
H  1.718146 -1.607439 -2.065701
H  -4.189489 1.699468 -1.921429
H  -5.323603 -0.936588 1.343589
H  -5.97396 0.637112 -0.502774
H  4.227241 -1.719316 -1.965421
H  5.494236 -0.344975 -0.248829
H  0.619104 -1.077948 1.883756
H  -1.028761 -0.922629 2.448715
