program: Gaussian 09
title: 000210825
version: EM64L-G09RevD.01
frameworkgroup: C1[X(C12H15NO2S2)]
method: RPBEPBE
basis: SDD
operation: Freq
keyword: #p
keyword: freq=noraman
keyword: PBEPBE/SDD
title: #p freq=noraman PBEPBE/SDD
converged: YES YES NO NO
title: Mulliken charges:
elementType: S S O O N C C C C C C C C C C C C H H H H H H H H H H H H H H H
charge: 0.214596 0.224505 -0.354205 -0.277216 -0.140455 -0.940962 0.418140 -0.625406 -0.621969 0.262882 -0.316302 -0.321478 -0.256691 -0.225701 0.292407 -0.609026 -0.622763 0.337948 0.279575 0.268981 0.277919 0.261792 0.253990 0.286819 0.227218 0.229604 0.227983 0.277711 0.227426 0.222901 0.229759 0.290016
chargesum: 0.00000
title: Mulliken charges with hydrogens summed into heavy atoms:
elementType: S S O O N C C C C C C C C C C C C
charge: 0.214596 0.224505 -0.354205 -0.277216 -0.140455 -0.603014 0.418140 -0.076850 -0.082258 0.262882 -0.062312 -0.034659 -0.029473 0.003903 0.292407 0.124094 0.119913
polarizability: 2.19673402e+02 3.30339869e+00 1.97897639e+02 5.45257725e-01 2.41773719e+00 1.16345256e+02
1716.lowfreq: -11.2079 -3.9595 -0.0027 -0.0023 -0.0021 3.2425 18.5644 28.3777 45.0851
frequency: 18.2877 28.1112 44.9676 52.3079 73.3920 95.1225 100.0826 118.2835 132.6030 174.8779 185.6685 218.6316 228.8220 246.8297 273.8096 297.1308 357.3405 383.8250 408.0478 433.5792 441.7330 455.2881 528.0578 578.1595 591.2772 617.2769 619.3760 638.3877 652.4902 677.1918 703.3955 742.5228 765.1580 771.9004 797.1807 848.9577 849.4537 870.9353 948.0993 958.0298 982.4653 983.4660 1006.2986 1043.1401 1056.8406 1083.6895 1097.5383 1099.1099 1116.3521 1135.4458 1144.4142 1148.3439 1167.6448 1180.4451 1211.5554 1230.2340 1248.0862 1258.0257 1284.0947 1289.5453 1367.7814 1382.5664 1421.4769 1432.4897 1434.8431 1437.4789 1444.2880 1468.0001 1471.4711 1477.5446 1487.6113 1498.9577 1588.3132 1603.0770 1670.7803 2969.0426 2974.9698 3023.7567 3032.1980 3044.0663 3048.1728 3091.7541 3096.4069 3115.3396 3126.1726 3131.8072 3144.7561 3145.4179 3162.6570 3200.1722
redmass: 4.4603 6.3189 3.6196 4.9022 2.5707 4.6717 1.5578 3.1780 1.1627 4.1428 5.8930 7.6078 2.3750 2.9465 5.1540 5.0791 3.5548 10.2037 5.1552 3.5377 4.2056 3.5880 4.2992 6.5124 6.5982 6.0264 6.3040 3.7749 5.0339 11.4427 6.0393 3.8584 2.0178 2.5198 5.8489 1.6662 4.3507 1.4787 1.3836 1.4583 3.4993 1.3363 2.3798 2.0804 1.3769 2.2565 1.2244 1.0994 2.4750 1.1736 1.3329 1.3739 1.3261 1.4347 2.5670 1.5980 5.3500 1.2529 1.3706 1.1674 3.1140 7.7195 1.1548 1.0836 1.2616 2.0238 1.1009 2.5258 1.0666 1.0456 1.0475 1.1624 6.7726 6.7145 8.5658 1.0381 1.0374 1.0551 1.0593 1.1002 1.1018 1.0856 1.1073 1.1083 1.0975 1.0856 1.0911 1.0959 1.0983 1.0949
irintensity: 2.5568 2.3322 2.6601 0.4006 0.8402 1.6537 0.9700 0.8411 0.1702 2.8752 2.0580 0.3190 2.4661 5.0932 1.3664 2.7300 22.8124 1.5561 0.8132 6.3388 2.2822 5.1170 1.7013 10.0897 6.8428 3.6696 1.5358 2.0818 15.1503 15.9662 17.5507 26.0062 25.1550 37.0697 37.5294 3.6857 25.1127 2.1640 1.1789 2.7326 37.9817 0.6158 5.0290 8.3172 23.6140 47.5974 1.6982 22.2516 682.7518 0.8464 6.1287 5.1499 56.4819 66.7551 111.8022 19.0399 4.3471 3.7771 0.3109 12.1245 202.1449 3.0847 25.0059 10.4553 39.2621 15.4725 5.9355 73.6774 19.9336 2.7623 31.5591 33.9996 7.2401 10.2626 342.2981 27.0127 121.1431 13.4010 41.6104 50.8414 20.3529 0.3684 0.4151 16.3819 1.9651 1.4310 8.5489 1.3913 28.4575 1.6221
temp: 298.150 k
press: 1.00000 atm
elementType: 16 16 8 8 7 6 6 6 6 6 6 6 6 6 6 6 6 1 1 1 1 1 1 1 1 1 1 1 1 1 1 1
symmnumber: 1
zpe: 653081.5 jmol-1
zpe.correction: 0.248746 hartree
zpe.thermalcorrener: 0.266590 hartree
zpe.thermalcorrenthalpy: 0.267535 hartree
zpe.thermalcorrgfe: 0.200272 hartree
zpe.sumelectzpe: -1466.328830 hartree
zpe.sumelectthermal: -1466.310985 hartree
zpe.sumelectthermalent: -1466.310041 hartree
zpe.sumelectthermalfe: -1466.377304 hartree
dipole: 0.7474 -2.5034 -2.1123
dipole: 3.3597
quadrupole: -96.9006 -107.6176 -120.3717
quadrupole: 10.6258 -2.8356 -2.4549
quadrupole: 11.3960 0.6790 -12.0750 10.6258 -2.8356 -2.4549
hfenergy: -1466.5775759 hartree
pointgroup: C01 [X(C12H15N1O2S2)]
dipole: -0.186065 -0.862608 0.984091 debye
polarizability: 219.7350093|1.4211003|194.2722712|6.5639914|-15.7580965|119.9090173 unknown
InChI: InChI=1S/C12H15NO2S2/c1-13(2)12(14)15-10-6-4-3-5-9(10)11-16-7-8-17-11/h3-6,11H,7-8H2,1-2H3
charge 0 multiplicity 1
32 atoms
S  -1.286171 -1.958552 1.110084
S  -2.782744 -1.61539 -1.560926
O  1.261656 -0.076491 -0.057503
O  3.111199 1.212923 -0.810344
N  3.38872 -0.905864 0.16452
C  -1.223168 -1.091568 -0.595185
C  -1.043581 0.407535 -0.467431
C  -3.162332 -1.798208 1.214963
C  -3.747023 -2.345428 -0.089987
C  0.263379 0.92312 -0.225775
C  -2.109902 1.333074 -0.557561
C  0.504928 2.305133 -0.078391
C  -1.889804 2.71942 -0.405658
C  -0.583371 3.201117 -0.169443
C  2.652347 0.171571 -0.277131
C  4.84549 -0.890604 -0.04787
C  2.820798 -2.108915 0.796175
H  -0.361267 -1.554421 -1.097525
H  -3.421398 -0.738307 1.373258
H  -3.48148 -2.393039 2.087798
H  -3.65517 -3.441492 -0.137794
H  -4.800743 -2.043547 -0.220465
H  -3.109393 0.948077 -0.784993
H  1.520399 2.671216 0.078992
H  -2.72961 3.417897 -0.48487
H  -0.401328 4.275877 -0.061427
H  5.376106 -0.963772 0.920352
H  5.125792 0.050235 -0.54381
H  5.15196 -1.742801 -0.684237
H  3.395389 -2.35014 1.7102
H  2.876032 -2.977302 0.110551
H  1.772089 -1.936757 1.069732
