program: Gaussian 09
title: 000210824
version: EM64L-G09RevD.01
frameworkgroup: C1[X(C12H13N3OS)]
method: RPBEPBE
basis: SDD
operation: Freq
keyword: #p
keyword: freq=noraman
keyword: PBEPBE/SDD
title: #p freq=noraman PBEPBE/SDD
converged: YES YES NO NO
title: Mulliken charges:
elementType: S O N N N C C C C C C C C C C C C H H H H H H H H H H H H H
charge: 0.155713 -0.292797 -0.404658 -0.044056 -0.564572 -0.503383 0.481069 -0.428485 0.275296 0.352626 -0.442204 -0.373391 -0.770312 -0.157411 -0.219019 -0.224812 -0.242825 0.226153 0.269224 0.305864 0.231445 0.250123 0.235037 0.233516 0.296406 0.225937 0.226341 0.228747 0.333022 0.341407
chargesum: 0.00000
title: Mulliken charges with hydrogens summed into heavy atoms:
elementType: S O N N N C C C C C C C C C C C C
charge: 0.155713 -0.292797 -0.098794 -0.044056 0.109857 -0.008006 0.481069 -0.428485 0.275296 0.352626 -0.210760 -0.123268 -0.005354 -0.157411 0.006917 0.001530 -0.014077
polarizability: 2.50634557e+02 4.65902803e+00 1.58555147e+02 2.00240665e+01 -8.90347180e-01 1.21360470e+02
1716.lowfreq: -3.7802 -0.0009 -0.0005 0.0014 3.0103 5.2751 12.3728 27.3449 32.9834
frequency: 10.0204 27.2360 32.9315 43.8318 93.9372 102.4345 127.8649 177.5006 198.2231 219.7928 238.4009 295.6699 306.3533 309.7771 337.3434 363.3651 394.4116 404.0906 442.8759 450.3159 490.1329 531.5794 537.8292 575.7726 581.0812 596.0753 610.5385 618.0496 626.1464 705.4766 720.9050 745.3889 763.2074 819.9327 855.9353 910.2273 916.2641 954.0881 978.7460 990.0637 991.9081 996.6383 1026.2184 1034.4094 1047.8375 1084.0952 1089.0204 1135.3755 1172.0350 1186.6349 1214.0426 1227.3685 1252.0041 1277.9862 1316.7252 1321.7573 1353.3583 1386.9844 1389.8148 1439.7556 1442.3786 1472.8655 1479.0256 1484.5391 1488.2901 1538.0703 1554.9460 1572.3682 1595.5179 1615.2629 1626.4358 2975.3468 2988.8951 3035.7938 3066.6724 3114.5623 3124.2430 3136.0884 3137.7054 3146.7831 3163.3323 3535.6218 3553.1502 3705.4745
redmass: 5.0486 4.0014 5.8291 7.0089 1.9412 1.6396 4.9227 3.6348 4.0770 4.6977 4.5146 3.4140 4.2482 3.2101 1.2358 8.8765 3.4160 2.8222 3.6829 1.2848 4.6135 2.2009 2.4579 3.5329 4.2468 3.2230 7.1255 6.2806 5.8586 1.8764 9.4482 2.5867 2.6551 3.9200 1.2482 2.1565 1.9174 2.9992 1.3905 6.1225 2.1020 1.3824 2.1792 2.8764 1.5101 1.6392 1.8497 4.0862 1.0535 1.1115 2.4583 1.2168 2.5506 3.0077 1.4219 6.6218 1.4900 4.5749 1.2970 1.3882 1.8595 1.2558 1.0687 1.9208 1.6895 4.3937 4.2895 2.6151 6.0771 5.9123 1.8113 1.0626 1.0381 1.0978 1.0968 1.0871 1.0860 1.0913 1.0990 1.0961 1.1015 1.0780 1.0452 1.1046
irintensity: 0.2116 0.3795 0.2900 9.0760 0.1096 0.3843 0.0508 0.9424 7.6608 1.5560 5.7235 7.4735 6.9345 4.6703 74.0509 1.2851 9.9373 0.6744 9.3441 204.8383 40.9233 85.7839 56.9762 2.3708 21.5386 38.7995 6.3767 0.9680 0.4628 47.7893 10.9379 17.8788 43.1451 4.4760 0.1221 3.1226 9.9749 34.9243 0.2482 0.4609 15.6900 1.4505 13.4453 6.2169 6.3285 24.7395 5.1918 57.7057 0.0950 2.8049 2.1941 39.6230 28.7407 257.7382 31.9423 100.0582 13.1338 13.8243 59.8915 24.1473 41.7763 51.0067 18.5331 120.6643 150.5232 312.0027 293.3741 0.6299 2.3803 14.6629 420.1705 52.5572 24.7552 16.0516 14.7650 8.9162 0.6507 15.1279 2.8707 42.1815 23.8643 14.1407 153.9052 48.6700
temp: 298.150 k
press: 1.00000 atm
elementType: 16 8 7 7 7 6 6 6 6 6 6 6 6 6 6 6 6 1 1 1 1 1 1 1 1 1 1 1 1 1
symmnumber: 1
zpe: 607709.9 jmol-1
zpe.correction: 0.231464 hartree
zpe.thermalcorrener: 0.248085 hartree
zpe.thermalcorrenthalpy: 0.249029 hartree
zpe.thermalcorrgfe: 0.184013 hartree
zpe.sumelectzpe: -1101.408856 hartree
zpe.sumelectthermal: -1101.392236 hartree
zpe.sumelectthermalent: -1101.391291 hartree
zpe.sumelectthermalfe: -1101.456307 hartree
dipole: 0.9324 -5.1480 -1.1814
dipole: 5.3635
quadrupole: -87.8669 -103.6522 -103.5686
quadrupole: -11.8388 1.5113 -1.2438
quadrupole: 10.4957 -5.2896 -5.2060 -11.8388 1.5113 -1.2438
hfenergy: -1101.6403202 hartree
pointgroup: C01 [X(C12H13N3O1S1)]
dipole: 0.3905202 2.0502971 -0.3107609 debye
polarizability: 249.2313538|-13.4510227|153.462406|-20.4915647|-12.585617|127.8564139 unknown
InChI: InChI=1S/C12H13N3OS/c1-8-10(17-12(13)15-8)11(16)14-7-9-5-3-2-4-6-9/h2-6,14H,7,13H2,1H3
charge 0 multiplicity 1
30 atoms
S  2.165305 1.512003 -0.047907
O  0.631905 -2.196113 0.809489
N  -0.299289 -0.069534 0.950104
N  4.290643 -0.072614 -0.448395
N  4.74012 2.234625 -0.873307
C  -1.608267 -0.571281 1.394295
C  -2.763918 -0.052409 0.544801
C  2.025716 -0.308335 0.228401
C  0.761328 -0.930982 0.676627
C  3.251739 -0.925199 -0.044074
C  -3.935492 0.453354 1.15991
C  -2.696922 -0.094738 -0.871835
C  3.559327 -2.394491 0.057366
C  3.920238 1.198523 -0.504535
C  -5.024811 0.902616 0.378061
C  -3.781798 0.355768 -1.654834
C  -4.950843 0.855582 -1.032541
H  -1.779043 -0.309573 2.457666
H  -1.533002 -1.674084 1.337157
H  -0.182733 0.941253 0.855165
H  -3.996601 0.49516 2.254949
H  -1.792775 -0.48395 -1.354425
H  3.878923 -2.775145 -0.930256
H  4.404564 -2.54908 0.752648
H  2.679063 -2.9541 0.401052
H  -5.925013 1.291135 0.867679
H  -3.719331 0.314824 -2.748275
H  -5.792747 1.205073 -1.640662
H  4.418636 3.197429 -0.899495
H  5.701578 2.013381 -1.124829
