program: Gaussian 09
title: 000210819
version: EM64L-G09RevD.01
frameworkgroup: C1[X(C15H22N2S)]
method: RPBEPBE
basis: SDD
operation: Freq
keyword: #p
keyword: freq=noraman
keyword: PBEPBE/SDD
title: #p freq=noraman PBEPBE/SDD
converged: YES YES NO NO
title: Mulliken charges:
elementType: S N N C C C C C C C C C C C C C C C H H H H H H H H H H H H H H H H H H H H H H
charge: 0.197003 -0.106805 -0.058069 -0.119849 -0.361104 -0.345425 -0.475066 -0.394329 -0.399628 0.534511 -0.321184 -0.405019 -0.689902 -0.614422 -0.449843 -0.247868 -0.239722 -0.244491 0.181730 0.190391 0.206062 0.230078 0.184948 0.214144 0.219573 0.184463 0.203087 0.203811 0.194453 0.193919 0.243829 0.256532 0.251910 0.222158 0.220196 0.186831 0.237999 0.256490 0.228536 0.230074
chargesum: 0.00000
title: Mulliken charges with hydrogens summed into heavy atoms:
elementType: S N N C C C C C C C C C C C C C C C
charge: 0.197003 -0.106805 -0.058069 0.061881 0.035349 0.069601 -0.041349 -0.006780 -0.001364 0.534511 0.116565 -0.405019 -0.181460 0.014762 -0.211845 0.008622 -0.011186 -0.014416
polarizability: 2.00848346e+02 2.70955081e+01 1.92231879e+02 5.48545367e+00 -6.40596797e+00 1.65274676e+02
1716.lowfreq: -27.7770 -9.1831 -1.9839 0.0007 0.0009 0.0018 31.0522 36.4482 63.2745
frequency: 30.0934 36.2715 63.2676 84.5430 118.2747 139.4017 195.9809 212.4616 218.3170 229.3213 247.3754 271.2629 280.3048 296.6733 326.1055 334.5023 350.5250 385.8187 399.1198 415.7314 436.1384 482.5473 488.3904 527.0359 564.8407 604.7438 610.2746 643.9071 660.1360 742.4672 756.4084 762.3683 766.2119 787.8649 836.5182 847.5251 867.8213 883.5528 924.8346 932.6853 954.4857 960.4875 988.7306 1008.2555 1019.2532 1030.2981 1037.6654 1047.4263 1055.1789 1076.6226 1079.9101 1090.3651 1119.8211 1125.1340 1134.7184 1144.9227 1149.5989 1153.7954 1173.1643 1190.6161 1198.9379 1212.6126 1229.8453 1252.0794 1264.6974 1270.4843 1282.9979 1286.0613 1303.3143 1305.4500 1333.5151 1340.8401 1353.2989 1355.3124 1362.8549 1373.1578 1377.5325 1389.9009 1423.6541 1427.7215 1431.3143 1439.2000 1450.9118 1452.8704 1457.6901 1459.8573 1463.6362 1471.6303 1473.6548 1479.9160 1572.4471 1592.8840 2805.1042 2835.8343 2847.2522 2853.0123 2858.1597 2872.3075 2963.1868 2986.7845 3010.5204 3015.0429 3020.8822 3027.1619 3030.3725 3049.5287 3052.8646 3069.9225 3073.1683 3084.0073 3115.9444 3131.7362 3146.3206 3163.7302
redmass: 2.9460 4.5101 4.3570 3.6638 3.4574 3.9581 2.8001 2.1174 1.4420 2.5379 3.9385 2.4440 2.7590 3.5669 2.4176 2.9519 2.5518 2.8237 3.1536 2.9007 2.8813 2.7980 2.9896 3.2439 3.3961 3.4929 3.7253 3.1905 5.0443 3.6025 2.9942 2.3630 1.7858 2.4230 1.9820 1.5378 2.2614 1.4650 2.4729 2.0251 1.6066 2.0303 1.3330 2.3693 2.8250 5.5462 2.2742 1.6206 1.9420 1.7412 1.7126 1.7772 2.0279 1.7923 2.0897 2.0000 3.0652 1.7612 1.0717 1.0910 1.3871 1.6076 2.0700 1.3533 1.3463 1.3417 1.4377 1.5276 1.2702 1.1897 1.4953 1.4107 1.4511 2.0252 1.5397 1.4414 1.6272 1.6908 1.9578 1.1697 1.1052 1.0858 1.0770 1.0797 1.0905 1.9739 1.1172 1.1091 1.1167 1.0545 6.1283 6.3162 1.0803 1.0703 1.0649 1.0692 1.0657 1.0668 1.0651 1.0618 1.0591 1.0728 1.0881 1.0902 1.0999 1.0875 1.0937 1.0879 1.1009 1.1057 1.0871 1.0877 1.0936 1.1008
irintensity: 0.0762 0.8304 0.1244 0.0745 2.1923 1.8827 0.4913 1.0029 0.2922 0.2227 0.3963 1.2612 2.0205 4.3947 8.9105 1.5724 0.1306 0.4055 0.3234 0.8338 3.0463 0.0776 5.4649 1.4013 0.6821 0.9338 0.4053 3.5246 2.4953 2.5666 17.4986 19.1300 42.6720 29.7540 2.8381 0.0472 4.1927 1.7037 18.1433 9.3984 5.9878 26.2257 0.0973 36.9440 3.7880 16.7285 4.2996 1.7714 0.5080 4.1448 2.2070 13.7243 13.4960 8.0972 9.6656 6.7906 42.1912 25.3952 0.6485 0.1042 1.8489 4.0415 10.0711 6.4280 3.7945 5.8588 22.1141 19.4790 3.5045 13.5548 7.9230 3.4797 1.8978 0.5157 3.5097 6.6098 1.0297 4.9257 10.5388 1.6116 9.6536 13.2006 0.2231 1.2111 35.6542 22.3123 7.0294 15.5089 15.4643 9.6579 2.9407 2.5980 62.2229 67.8107 56.3475 60.0002 37.0934 268.9111 36.5819 46.7102 44.6170 45.6515 56.2946 52.8486 23.9090 51.2824 21.2433 18.8296 36.5064 20.2174 6.8097 6.3622 17.9067 31.0241
temp: 298.150 k
press: 1.00000 atm
elementType: 16 7 7 6 6 6 6 6 6 6 6 6 6 6 6 6 6 6 1 1 1 1 1 1 1 1 1 1 1 1 1 1 1 1 1 1 1 1 1 1
symmnumber: 1
zpe: 899622.9 jmol-1
zpe.correction: 0.342648 hartree
zpe.thermalcorrener: 0.359543 hartree
zpe.thermalcorrenthalpy: 0.360487 hartree
zpe.thermalcorrgfe: 0.298004 hartree
zpe.sumelectzpe: -1090.946144 hartree
zpe.sumelectthermal: -1090.929250 hartree
zpe.sumelectthermalent: -1090.928305 hartree
zpe.sumelectthermalfe: -1090.990788 hartree
dipole: -0.0133 0.5887 1.4440
dipole: 1.5595
quadrupole: -111.6391 -109.5294 -115.9582
quadrupole: 5.0972 -2.3320 2.6629
quadrupole: 0.7365 2.8462 -3.5827 5.0972 -2.3320 2.6629
hfenergy: -1091.2887923 hartree
pointgroup: C01 [X(C15H22N2S1)]
dipole: 0.0038224 -0.2867884 0.5423743 debye
polarizability: 201.6380258|27.3889391|189.8861987|-2.8247153|8.8333401|166.8306769 unknown
InChI: InChI=1S/C15H22N2S/c1-16-8-10-17(11-9-16)14-6-4-12-18-15-7-3-2-5-13(14)15/h2-3,5,7,14H,4,6,8-12H2,1H3
charge 0 multiplicity 1
40 atoms
S  1.366692 -1.125156 -1.935386
N  -1.03053 -0.212102 0.375813
N  -3.689155 0.84988 -0.171634
C  0.222924 -0.448917 1.158374
C  -2.232981 -0.714278 1.089964
C  -1.237554 1.208359 -0.007416
C  0.483825 -1.976676 1.365536
C  -3.490181 -0.56344 0.2177
C  -2.490349 1.351199 -0.884804
C  1.437367 0.297733 0.586012
C  0.312487 -2.876797 0.121635
C  2.007047 0.087546 -0.704506
C  1.414716 -2.73752 -0.937677
C  -4.930279 1.051909 -0.941491
C  2.040723 1.282126 1.414138
C  3.107803 0.868609 -1.137541
C  3.140792 2.057932 0.988679
C  3.671454 1.859018 -0.304423
H  0.08794 -0.029912 2.192095
H  -2.391826 -0.161813 2.052427
H  -2.1025 -1.783706 1.330947
H  -0.360737 1.558868 -0.576112
H  -1.35217 1.863151 0.893955
H  -0.200055 -2.342993 2.155509
H  1.506876 -2.090921 1.775293
H  -3.382979 -1.225694 -0.680966
H  -4.374431 -0.904268 0.789556
H  -2.644435 2.41913 -1.129644
H  -2.319887 0.795531 -1.842224
H  0.302413 -3.935473 0.457621
H  -0.664665 -2.67019 -0.351718
H  2.424022 -2.818294 -0.497268
H  1.309493 -3.513284 -1.717189
H  -5.060485 2.127033 -1.161102
H  -5.798153 0.71732 -0.344442
H  -4.94435 0.49645 -1.914272
H  1.618368 1.45161 2.412222
H  3.52777 0.679022 -2.130947
H  3.572935 2.810514 1.657187
H  4.522455 2.451794 -0.657504
