program: Gaussian 09
title: 000210817
version: EM64L-G09RevD.01
frameworkgroup: C1[X(C14H19NOS)]
method: RPBEPBE
basis: SDD
operation: Freq
keyword: #p
keyword: freq=noraman
keyword: PBEPBE/SDD
title: #p freq=noraman PBEPBE/SDD
converged: YES YES NO NO
title: Mulliken charges:
elementType: S O N C C C C C C C C C C C C C C H H H H H H H H H H H H H H H H H H H
charge: 0.198745 -0.244252 -0.120035 -0.125540 -0.471592 -0.351474 -0.337694 0.535607 -0.319403 -0.328779 -0.334573 -0.689389 -0.406681 -0.449796 -0.245650 -0.238037 -0.243794 0.184759 0.213911 0.222024 0.193663 0.213111 0.237092 0.189452 0.195960 0.240702 0.190457 0.211197 0.211988 0.200067 0.257654 0.253405 0.238185 0.257522 0.229761 0.231426
chargesum: 0.00000
title: Mulliken charges with hydrogens summed into heavy atoms:
elementType: S O N C C C C C C C C C C C C C C
charge: 0.198745 -0.244252 -0.120035 0.059220 -0.035657 0.055300 0.088850 0.535607 0.117259 0.072875 0.077482 -0.178330 -0.406681 -0.211611 0.011871 -0.008276 -0.012368
polarizability: 1.84689829e+02 2.84758418e+01 1.75537648e+02 9.77101302e+00 -8.68458682e+00 1.49842011e+02
1716.lowfreq: -13.0101 -0.0018 -0.0012 0.0011 11.8422 15.3828 49.0885 52.0888 69.9273
frequency: 48.4057 51.9284 69.9097 94.0313 135.3361 151.7713 226.6711 228.2239 245.8408 271.5764 272.9130 300.0697 322.8168 340.9227 395.6723 400.4374 415.1852 437.2604 464.1941 488.7939 524.9702 563.8885 601.6853 609.1522 641.7844 661.3509 743.5219 762.2699 765.3621 782.1845 810.0300 837.7832 843.9450 866.2254 884.1334 915.9492 923.6241 954.0757 958.9568 989.2291 1013.6482 1026.3749 1031.5878 1036.2386 1051.9693 1057.1389 1084.5602 1087.6984 1103.9094 1124.3811 1127.0701 1149.7085 1162.1227 1174.1506 1193.4405 1202.7322 1213.5257 1245.9531 1255.2196 1266.5622 1270.1937 1284.1584 1293.3641 1307.1241 1332.4871 1341.5849 1352.0491 1358.7157 1363.6617 1375.7606 1378.2276 1390.1283 1424.3697 1432.8435 1433.9042 1443.7459 1447.5742 1453.4068 1462.6318 1465.7225 1473.5495 1573.9800 1593.9174 2809.3332 2848.6748 2863.9504 2951.0225 2963.5022 2965.4536 2987.3547 3011.2534 3030.5273 3042.7500 3052.1498 3062.1381 3076.5061 3083.2377 3084.8590 3118.9913 3133.5293 3147.8683 3165.1211
redmass: 4.5308 3.7022 4.6606 3.4284 4.3398 3.6548 2.3611 2.7285 3.2275 3.4170 3.9922 3.9072 2.6187 3.2449 2.1112 5.7938 2.6856 2.9705 2.8079 3.0477 3.3471 3.4507 2.5684 4.8420 3.2202 5.2549 3.4823 1.4571 3.3580 2.4469 3.6030 2.0501 1.6064 2.2308 1.4684 2.3576 2.5024 1.8360 1.8030 1.3341 2.6088 2.1776 6.0264 2.2586 2.0969 2.0202 3.2269 2.0668 2.2332 2.0015 2.3504 1.4815 2.9659 1.0725 1.0797 1.2607 1.6599 1.3036 1.2664 1.3495 1.2885 1.3396 1.2232 1.1827 1.3445 1.4568 1.4618 1.8194 1.5393 1.2833 1.5956 1.7147 1.9861 1.0857 1.1003 1.0823 1.0827 1.0970 1.8295 1.1748 1.1468 6.1806 6.3093 1.0805 1.0711 1.0700 1.0666 1.0661 1.0647 1.0620 1.0591 1.0995 1.0879 1.0954 1.0884 1.0962 1.0981 1.1059 1.0867 1.0879 1.0937 1.1008
irintensity: 0.3984 0.3755 0.1185 0.2956 0.3595 5.1327 1.1414 2.7102 0.2032 2.6796 0.9484 4.8071 6.6768 0.7474 0.6508 0.3260 1.2226 2.1091 1.0899 8.4182 7.4128 0.5396 1.5565 0.6663 3.7560 3.1443 4.2171 62.2048 1.7082 25.9037 23.6438 6.6809 0.5679 3.0532 2.9616 19.8546 14.3952 15.8770 26.0247 0.0997 11.7211 10.5183 16.6212 8.3475 16.5555 0.9431 32.1329 21.7071 1.3106 10.1246 22.6847 8.7637 6.4285 0.5341 1.8409 1.3924 5.2045 13.5189 19.7088 15.1110 4.0537 3.8808 3.6415 10.3932 5.1550 7.4837 3.5222 0.6629 1.2691 3.7464 2.9070 7.2595 11.4348 12.1560 10.0274 3.2474 2.7789 17.4194 24.1230 1.6004 20.3269 3.0162 2.6086 57.6388 69.2247 116.8156 54.4994 58.5053 37.5227 47.4683 40.1574 23.0895 50.4735 24.4602 20.3742 45.1700 34.8776 19.2093 6.0979 6.4837 17.4346 29.3206
temp: 298.150 k
press: 1.00000 atm
elementType: 16 8 7 6 6 6 6 6 6 6 6 6 6 6 6 6 6 1 1 1 1 1 1 1 1 1 1 1 1 1 1 1 1 1 1 1
symmnumber: 1
zpe: 797080.2 jmol-1
zpe.correction: 0.303592 hartree
zpe.thermalcorrener: 0.318770 hartree
zpe.thermalcorrenthalpy: 0.319714 hartree
zpe.thermalcorrgfe: 0.261366 hartree
zpe.sumelectzpe: -1071.598872 hartree
zpe.sumelectthermal: -1071.583694 hartree
zpe.sumelectthermalent: -1071.582750 hartree
zpe.sumelectthermalfe: -1071.641098 hartree
dipole: -1.5555 1.0169 2.3892
dipole: 3.0269
quadrupole: -114.2764 -103.4451 -107.9253
quadrupole: 10.3328 4.0353 0.8635
quadrupole: -5.7274 5.1038 0.6236 10.3328 4.0353 0.8635
hfenergy: -1071.9024638 hartree
pointgroup: C01 [X(C14H19N1O1S1)]
dipole: -0.6256832 0.5089318 0.8761652 debye
polarizability: 184.395746|29.6268557|173.2018774|6.7696115|-11.0556824|152.4718638 unknown
InChI: InChI=1S/C14H19NOS/c1-2-6-14-12(4-1)13(5-3-11-17-14)15-7-9-16-10-8-15/h1-2,4,6,13H,3,5,7-11H2
charge 0 multiplicity 1
36 atoms
S  -1.06358 1.315747 -1.830371
O  3.837225 -1.29264 -0.608404
N  1.350421 -0.013567 0.235121
C  0.183544 0.290151 1.121916
C  0.108644 1.816054 1.453992
C  2.648446 0.298883 0.889848
C  1.375558 -1.411446 -0.271248
C  -1.139159 -0.278024 0.585392
C  0.297942 2.786204 0.267445
C  3.808596 0.084623 -0.097374
C  2.544694 -1.593013 -1.250304
C  -0.875393 2.843488 -0.721573
C  -1.759821 0.088935 -0.645526
C  -1.796048 -1.251172 1.385298
C  -2.965423 -0.535571 -1.052741
C  -3.000449 -1.869999 0.986034
C  -3.583876 -1.519297 -0.250818
H  0.338582 -0.220535 2.110205
H  0.87944 2.045434 2.21537
H  -0.86621 2.005532 1.94487
H  2.809374 -0.341749 1.795646
H  2.661161 1.353806 1.21732
H  0.43083 -1.62561 -0.799058
H  1.478781 -2.149534 0.564744
H  0.442155 3.809256 0.674804
H  1.215751 2.518093 -0.286927
H  3.703473 0.796842 -0.944894
H  4.782006 0.238144 0.398096
H  2.620378 -2.640187 -1.586952
H  2.398023 -0.925231 -2.126117
H  -1.841804 2.994574 -0.209483
H  -0.733883 3.66128 -1.450646
H  -1.334914 -1.539182 2.337932
H  -3.422247 -0.228414 -1.999314
H  -3.47187 -2.619673 1.630771
H  -4.515843 -1.9898 -0.582752
