program: Gaussian 09
title: 000210815
version: EM64L-G09RevD.01
frameworkgroup: C1[X(C15H21NS)]
method: RPBEPBE
basis: SDD
operation: Freq
keyword: #p
keyword: freq=noraman
keyword: PBEPBE/SDD
title: #p freq=noraman PBEPBE/SDD
converged: YES YES NO NO
title: Mulliken charges:
elementType: S N C C C C C C C C C C C C C C C H H H H H H H H H H H H H H H H H H H H H
charge: 0.197861 -0.099082 -0.115229 -0.370860 -0.356463 -0.476943 -0.402375 -0.403401 -0.400741 0.530924 -0.321029 -0.404798 -0.691076 -0.451590 -0.246686 -0.238715 -0.245260 0.179295 0.171917 0.214988 0.238670 0.164032 0.214034 0.219866 0.188422 0.205350 0.212380 0.189270 0.212678 0.187040 0.193887 0.244809 0.256421 0.251615 0.236857 0.256290 0.227880 0.229762
chargesum: 0.00000
title: Mulliken charges with hydrogens summed into heavy atoms:
elementType: S N C C C C C C C C C C C C C C C
charge: 0.197861 -0.099082 0.064066 0.016045 0.046239 -0.043043 -0.008603 -0.001751 -0.001023 0.530924 0.117667 -0.404798 -0.183040 -0.214733 0.009604 -0.010834 -0.015498
polarizability: 1.95311909e+02 2.57954008e+01 1.81556391e+02 7.27307312e+00 -9.17571443e+00 1.56123260e+02
1716.lowfreq: -10.5889 -0.0015 -0.0007 0.0011 9.3548 13.3656 45.7973 50.1985 70.1112
frequency: 45.5441 49.4080 70.1045 93.2210 135.1245 150.3517 222.5994 227.1890 246.4768 267.9066 272.3116 297.8125 318.5919 340.6143 386.4995 402.2256 414.2428 437.0655 444.4268 485.4986 503.1429 564.3129 583.3176 608.3422 639.5249 661.1239 743.6987 760.1579 764.0134 778.3570 804.3100 831.9208 853.5267 857.7679 869.6049 884.0524 920.1874 924.6594 952.4500 956.0505 957.7658 987.9180 1006.9674 1028.9930 1032.5192 1047.6336 1056.6805 1081.0365 1084.0823 1118.1647 1122.7709 1126.0888 1146.4768 1151.1533 1153.6053 1173.4703 1198.6927 1209.5152 1229.2165 1248.6619 1259.5501 1265.5249 1269.2348 1281.9839 1290.6171 1306.3718 1331.7264 1337.7778 1344.2664 1352.5346 1356.0271 1358.1206 1366.9463 1379.6583 1390.7113 1423.6378 1433.4043 1433.6770 1450.0388 1460.3408 1462.4597 1463.1408 1471.1253 1474.7750 1481.9614 1573.6078 1593.5571 2795.5730 2805.3743 2821.9883 2963.9211 2965.8019 2983.2221 2986.8597 2987.4043 3009.8716 3029.8239 3031.5268 3042.9518 3046.0137 3051.9528 3053.4921 3067.3044 3083.3187 3118.2372 3132.3221 3146.5647 3163.9802
redmass: 2.9499 5.1455 4.1898 3.1896 4.0083 3.1673 2.4027 2.2783 3.5568 3.1190 3.8880 3.2059 2.7654 3.0267 1.8944 4.5894 2.9233 2.8827 2.8940 2.6746 2.1816 3.4413 2.5230 5.4294 3.7518 5.2469 3.4620 1.5442 3.3687 2.2190 1.4804 2.0029 2.6321 1.4383 2.1279 1.5095 2.3259 2.4335 1.8582 1.3246 1.7334 1.3336 2.4476 3.3246 3.3806 2.2814 1.9315 1.4459 1.8613 2.4221 2.5347 1.7889 1.8615 1.4559 1.3892 1.0725 1.3946 1.5549 1.8500 1.3240 1.2575 1.3668 1.1750 1.2783 1.3253 1.2023 1.2892 1.6467 1.4528 1.5048 1.9969 1.4713 1.4635 1.6900 1.6319 1.9980 1.0877 1.0979 1.0900 1.0944 2.0534 1.0868 1.0942 1.1300 1.0953 6.1860 6.3117 1.0798 1.0720 1.0707 1.0650 1.0622 1.0611 1.0613 1.0619 1.0590 1.0981 1.0978 1.0977 1.0920 1.0952 1.1025 1.0876 1.1058 1.0864 1.0879 1.0937 1.1008
irintensity: 0.0594 0.5359 0.3119 0.5164 0.1077 2.4082 0.5996 1.1554 0.0618 1.0352 0.7990 0.6559 4.2825 1.5716 1.0241 0.2417 1.2731 2.9523 0.4259 5.0771 1.6390 0.7145 1.7441 0.3060 2.8084 2.7801 4.1496 55.7089 1.4302 37.0893 0.1469 1.5899 10.0584 3.7026 5.9483 2.6609 0.0724 14.6554 16.3745 2.0974 19.2489 0.1156 10.3516 14.1853 9.3644 5.4136 6.8116 8.6571 18.0215 8.0332 7.0248 1.5817 11.9465 10.1177 6.3235 0.3943 0.8259 3.9037 19.8647 5.2890 4.2132 5.4534 10.1159 4.6391 2.1866 11.3828 5.4193 8.1484 1.0879 3.2200 0.9083 0.4989 5.2056 0.5651 5.4438 9.7247 11.9381 10.9488 6.9722 17.3218 21.0217 3.0683 7.6074 21.9451 3.2558 2.9950 2.3488 33.8142 59.8115 191.4474 36.1547 41.2194 43.1231 39.5433 33.2289 43.8531 67.7572 25.3204 71.3509 14.3859 24.2209 76.2141 24.7298 20.5705 5.8072 7.1010 18.9671 31.1498
temp: 298.150 k
press: 1.00000 atm
elementType: 16 7 6 6 6 6 6 6 6 6 6 6 6 6 6 6 6 1 1 1 1 1 1 1 1 1 1 1 1 1 1 1 1 1 1 1 1 1
symmnumber: 1
zpe: 860291.0 jmol-1
zpe.correction: 0.327668 hartree
zpe.thermalcorrener: 0.343048 hartree
zpe.thermalcorrenthalpy: 0.343992 hartree
zpe.thermalcorrgfe: 0.285270 hartree
zpe.sumelectzpe: -1035.699167 hartree
zpe.sumelectthermal: -1035.683786 hartree
zpe.sumelectthermalent: -1035.682842 hartree
zpe.sumelectthermalfe: -1035.741565 hartree
dipole: 0.3361 -0.0698 2.0193
dipole: 2.0482
quadrupole: -105.6723 -104.1679 -110.5204
quadrupole: 3.1072 0.8755 0.6548
quadrupole: 1.1146 2.6189 -3.7335 3.1072 0.8755 0.6548
hfenergy: -1036.0268347 hartree
pointgroup: C01 [X(C15H21N1S1)]
dipole: -0.118219 0.0731791 -0.793756 debye
polarizability: 195.6711292|-26.5701545|178.296708|4.4770924|11.6498722|159.023723 unknown
InChI: InChI=1S/C15H21NS/c1-4-10-16(11-5-1)14-8-6-12-17-15-9-3-2-7-13(14)15/h2-3,7,9,14H,1,4-6,8,10-12H2
charge 0 multiplicity 1
38 atoms
S  1.040791 1.289789 1.849077
N  -1.352993 -0.024348 -0.255588
C  -0.178591 0.296893 -1.126614
C  -2.640415 0.31792 -0.916136
C  -1.370651 -1.433629 0.219038
C  -0.096153 1.827893 -1.437977
C  -3.833644 0.133423 0.044968
C  -2.51826 -1.668385 1.221383
C  -3.883259 -1.308214 0.595583
C  1.146036 -0.268519 -0.5888
C  -0.308999 2.780961 -0.241552
C  1.756493 0.08774 0.650416
C  0.851183 2.83348 0.763099
C  1.819343 -1.221424 -1.399324
C  2.966601 -0.52934 1.055363
C  3.028336 -1.832862 -1.00222
C  3.600838 -1.494341 0.243088
H  -0.320825 -0.200139 -2.124899
H  -2.799386 -0.31795 -1.830322
H  -2.609565 1.367882 -1.254714
H  -0.406297 -1.656226 0.703845
H  -1.483494 -2.145689 -0.643415
H  -0.849634 2.06896 -2.212458
H  0.889638 2.023063 -1.904599
H  -4.772005 0.386262 -0.486128
H  -3.720987 0.844429 0.886474
H  -2.339065 -1.037152 2.11296
H  -2.503705 -2.72598 1.54891
H  -4.69623 -1.414321 1.338803
H  -4.106886 -2.012271 -0.233082
H  -0.455647 3.808716 -0.636504
H  -1.231976 2.498158 0.296588
H  1.822305 3.00199 0.265303
H  0.692933 3.638319 1.503234
H  1.366142 -1.50038 -2.358443
H  3.414292 -0.231015 2.009183
H  3.511992 -2.567459 -1.655403
H  4.535943 -1.959633 0.573763
