program: Gaussian 09
title: 000210813
version: EM64L-G09RevD.01
frameworkgroup: C1[X(C14H17N3OS)]
method: RPBEPBE
basis: SDD
operation: Freq
keyword: #p
keyword: freq=noraman
keyword: PBEPBE/SDD
title: #p freq=noraman PBEPBE/SDD
converged: YES YES NO NO
title: Mulliken charges:
elementType: S O N N N C C C C C C C C C C C C C C H H H H H H H H H H H H H H H H H
charge: 0.159328 -0.261516 -0.504332 -0.042311 -0.564918 0.166723 0.376436 0.354215 0.490331 -0.597127 -0.612937 -0.831548 -0.844495 0.212663 -0.818108 -0.427845 0.348607 -0.766812 -0.161411 0.235345 0.235298 0.308498 0.222077 0.285201 0.217132 0.247239 0.222064 0.236000 0.221556 0.223707 0.235905 0.291622 0.238187 0.231445 0.332639 0.341143
chargesum: 0.00000
title: Mulliken charges with hydrogens summed into heavy atoms:
elementType: S O N N N C C C C C C C C C C C C C C
charge: 0.159328 -0.261516 -0.195834 -0.042311 0.108864 0.166723 0.376436 0.354215 0.490331 -0.361782 -0.377640 -0.107138 -0.139192 0.212663 -0.136940 -0.427845 0.348607 -0.005558 -0.161411
polarizability: 3.22320195e+02 5.96692408e+00 1.77975504e+02 -3.38726243e-01 2.69232747e+00 1.33725762e+02
1716.lowfreq: -40.9977 -10.7320 -3.5094 -2.4554 -0.0012 0.0012 0.0014 23.5857 32.3613
frequency: -40.4465 23.3057 32.3513 42.4596 89.2747 96.5998 101.7231 109.2565 142.9276 165.4028 180.6761 187.7843 198.1158 226.0926 239.4672 268.4740 277.5107 291.1874 312.3386 326.4964 338.8559 368.0488 375.7348 411.6955 449.0537 486.2035 493.0280 516.0027 531.1009 542.1107 552.0166 564.4971 571.1204 579.6572 589.0654 609.5371 625.0002 709.6221 731.1263 765.3073 831.4248 865.1955 892.2478 916.6318 939.6051 954.9623 981.1919 1013.5327 1019.4398 1039.2434 1042.3727 1046.3646 1046.4380 1052.1611 1055.5333 1090.9814 1165.2929 1233.2318 1246.5421 1259.6639 1276.7672 1321.5265 1325.7216 1368.0112 1391.9142 1395.7540 1396.6560 1399.3750 1415.8527 1437.8539 1448.3295 1453.9445 1466.0611 1470.5906 1471.4341 1475.7453 1476.7838 1490.4244 1494.7710 1537.6240 1561.4450 1579.9355 1600.0922 1621.2587 1625.8689 2958.6029 2972.9343 2977.0712 2990.2812 3038.1608 3053.6755 3058.8433 3068.0751 3081.7363 3085.0354 3087.9546 3114.1013 3118.8058 3137.1172 3490.2680 3552.6189 3705.0767
redmass: 1.0158 4.0936 5.0277 4.6942 4.0075 1.2872 6.5951 2.6416 1.1003 3.0453 2.5675 1.3091 4.0435 2.7528 4.5248 2.5138 5.7074 2.8735 2.8956 2.3762 1.6800 4.0332 5.4280 5.5465 1.2601 7.0675 3.0560 3.0726 5.3469 2.1172 2.4637 4.1313 3.5178 4.0443 2.8148 6.9020 5.7762 6.7496 4.2576 5.1103 5.6419 1.3489 1.3123 3.5255 2.2905 3.3151 2.8999 1.6037 1.7129 1.6322 1.7778 1.5270 1.5281 1.7081 2.4281 2.2008 1.9014 3.0748 1.9126 1.7778 3.1775 6.7012 5.7922 6.3333 1.2595 1.2442 1.2644 1.2429 2.5470 1.3536 1.5123 1.2357 1.2229 1.1843 1.0613 1.0886 1.1085 1.2927 1.5349 4.3774 2.9941 3.6635 5.6789 5.7467 1.8118 1.0427 1.0384 1.0364 1.0382 1.0914 1.0952 1.0972 1.0968 1.0997 1.0999 1.0981 1.0912 1.0919 1.0990 1.0762 1.0452 1.1046
irintensity: 0.5526 0.1796 1.0514 1.3308 3.3968 0.1089 0.4861 0.6884 1.0599 2.5211 4.5566 2.5135 8.4038 0.3516 1.1903 0.8874 2.6530 14.1407 0.5875 18.2479 44.1990 2.2008 5.1147 3.1139 238.9009 19.1271 3.4870 0.4434 2.3699 36.9165 35.6275 3.1632 7.3369 6.4865 24.4850 12.2211 1.3213 12.1185 15.9059 40.7213 5.9551 23.5854 0.4037 6.8726 4.0021 0.3891 17.2345 9.5302 8.2914 1.6870 19.0960 3.7478 11.7513 27.4210 25.6508 11.8708 12.5078 1.3770 41.8307 5.0534 300.5577 121.4808 0.2102 56.7102 68.6220 5.1915 21.4948 10.5415 6.4812 21.9185 7.0040 139.8147 99.0888 87.0767 16.7780 3.9164 44.7483 73.2908 112.6768 198.9643 248.4468 37.4529 21.6903 8.6100 452.5496 35.6370 48.3425 23.3151 24.0394 19.1705 23.6970 9.4778 14.1599 17.3788 24.6772 22.6190 28.8627 21.9564 1.4883 11.6276 168.5265 48.2705
temp: 298.150 k
press: 1.00000 atm
elementType: 16 8 7 7 7 6 6 6 6 6 6 6 6 6 6 6 6 6 6 1 1 1 1 1 1 1 1 1 1 1 1 1 1 1 1 1
symmnumber: 1
zpe: 746508.0 jmol-1
zpe.correction: 0.284330 hartree
zpe.thermalcorrener: 0.303919 hartree
zpe.thermalcorrenthalpy: 0.304863 hartree
zpe.thermalcorrgfe: 0.235791 hartree
zpe.sumelectzpe: -1179.871075 hartree
zpe.sumelectthermal: -1179.851486 hartree
zpe.sumelectthermalent: -1179.850541 hartree
zpe.sumelectthermalfe: -1179.919614 hartree
dipole: -2.2274 -4.3484 -1.6924
dipole: 5.1705
quadrupole: -90.7042 -114.8738 -119.9770
quadrupole: 11.2642 7.3668 -1.1935
quadrupole: 17.8142 -6.3555 -11.4587 11.2642 7.3668 -1.1935
hfenergy: -1180.1554045 hartree
pointgroup: C01 [X(C14H17N3O1S1)]
dipole: 0.8056835 0.5439283 1.7869173 debye
polarizability: 321.7120343|3.1641256|133.6294367|10.7513372|-0.6702695|178.6799893 unknown
InChI: InChI=1S/C14H17N3OS/c1-7-5-8(2)11(9(3)6-7)17-13(18)12-10(4)16-14(15)19-12/h5-6,17H,15H2,1-4H3
charge 0 multiplicity 1
36 atoms
S  2.674891 0.890365 1.387169
O  0.435457 -0.562612 -1.707756
N  -0.165153 0.120991 0.452727
N  4.55921 -0.24797 -0.147453
N  5.449446 0.857801 1.773733
C  -1.592685 0.077577 0.292087
C  -2.247076 0.860165 -0.702661
C  -2.341492 -0.728245 1.200361
C  -4.430049 -0.010743 0.092436
C  -3.659231 0.789342 -0.783477
C  -3.74966 -0.752349 1.088823
C  -1.48012 1.769675 -1.638847
C  -1.638595 -1.556673 2.262295
C  0.777303 -0.178481 -0.542664
C  -5.941365 -0.085097 -0.041816
C  2.194162 -0.029669 -0.139747
C  3.336218 -0.522008 -0.779257
C  3.373708 -1.320138 -2.054078
C  4.415323 0.452052 0.968774
H  -4.16793 1.390271 -1.548136
H  -4.326254 -1.373796 1.785568
H  0.181657 0.194239 1.413739
H  -0.685236 2.322513 -1.104232
H  -0.977345 1.178549 -2.426044
H  -2.153832 2.501387 -2.1165
H  -0.838265 -2.179896 1.82195
H  -1.168795 -0.927035 3.045791
H  -2.351659 -2.225574 2.772451
H  -6.423527 -0.322117 0.923067
H  -6.36291 0.867146 -0.409945
H  -6.23838 -0.873795 -0.760584
H  2.358431 -1.518026 -2.423609
H  3.932683 -0.759808 -2.826344
H  3.916122 -2.26761 -1.883792
H  5.297075 1.394112 2.622371
H  6.396675 0.614854 1.490104
