program: Gaussian 09
title: 000216196
version: EM64L-G09RevD.01
frameworkgroup: C1[X(C11H14N2O5)]
method: RPBEPBE
basis: SDD
operation: Freq
keyword: #p
keyword: freq=noraman
keyword: PBEPBE/SDD
title: #p freq=noraman PBEPBE/SDD
converged: YES YES NO NO
title: Mulliken charges:
elementType: O O O O O N N C C C C C C C C C C C H H H H H H H H H H H H H H
charge: -0.428694 -0.215700 -0.439045 -0.486894 -0.295647 -0.368502 -0.520631 -0.145104 -0.568979 0.589096 -0.551428 -0.391985 0.154026 0.244343 0.179405 -0.372482 0.132679 -0.524855 0.290146 0.217996 0.258158 0.313711 0.255386 0.263980 0.227053 0.251980 0.222895 0.390059 0.384148 0.273315 0.287668 0.373902
chargesum: 0.00000
title: Mulliken charges with hydrogens summed into heavy atoms:
elementType: O O O O O N N C C C C C C C C C C C
charge: -0.038635 -0.215700 -0.054897 -0.112992 -0.295647 -0.054791 0.040352 0.145042 -0.092825 0.589096 -0.296042 -0.128005 0.154026 0.244343 0.179405 -0.145429 0.132679 -0.049980
polarizability: 1.79038858e+02 -1.92347817e+01 1.44962837e+02 5.90824033e+00 1.75000103e+01 1.22356381e+02
1716.lowfreq: -11.6009 -8.9213 -2.1198 0.0003 0.0004 0.0008 14.6858 25.1405 32.5392
frequency: 12.9424 25.1066 32.3674 36.5224 65.7688 71.2811 82.2265 126.2586 136.6528 171.6555 203.2421 217.8805 251.8090 265.5338 267.1376 280.2376 290.8186 335.7854 357.0146 398.6203 429.8555 436.8855 484.8520 516.1890 534.7394 549.6432 564.7938 576.4937 587.3017 607.4177 616.0710 667.6725 685.7675 712.8811 742.6054 752.5803 767.1808 786.8287 848.6612 858.4953 890.5185 898.1315 905.4086 923.8899 937.1402 1031.0655 1073.9725 1080.6965 1098.5447 1136.4872 1149.9967 1151.7688 1156.2633 1184.8976 1198.1822 1231.8522 1245.4060 1269.8401 1272.8894 1302.6341 1312.0064 1315.8241 1323.6574 1340.4905 1344.7703 1405.4545 1440.9918 1457.4940 1471.4456 1488.0258 1508.2647 1611.3967 1617.0787 1633.4845 1662.6072 1666.2646 2977.7575 2980.8063 3027.3570 3038.0066 3046.8678 3122.9408 3148.2270 3158.6487 3444.4877 3520.1638 3528.1608 3549.6446 3560.1035 3624.0293
redmass: 6.1712 8.0910 2.3378 4.9688 3.6626 7.4474 5.5772 4.7214 6.1243 5.5012 1.4893 4.0688 3.1603 1.2519 2.4397 5.0618 4.2283 4.9912 5.5242 3.2999 4.9480 2.8762 1.1133 3.8444 3.2223 3.6965 4.7488 2.6078 1.8204 1.4642 4.0897 2.4534 3.3947 3.7285 4.5121 2.5058 5.1225 1.4004 2.4232 2.3471 1.6750 1.9425 3.9598 1.5761 2.8325 3.0306 2.2702 2.3729 3.5340 1.7187 1.3316 1.7534 1.7953 1.3944 1.3593 1.8565 1.9148 1.6984 2.3011 1.5690 1.5905 1.5030 1.4816 1.3511 1.2792 4.3199 1.0893 1.1825 2.6726 1.8065 3.1187 6.9143 6.4982 6.5135 1.0845 9.0569 1.0595 1.0601 1.0966 1.1019 1.0878 1.0895 1.0918 1.0951 1.0458 1.0642 1.0649 1.0772 1.0954 1.0666
irintensity: 1.1551 1.8577 0.2968 2.2237 4.9348 9.4822 0.5595 0.8456 1.4873 0.8367 63.6686 17.2104 18.8552 96.3414 82.4981 6.1700 14.5573 3.0348 14.9940 2.7462 4.3981 19.3406 128.4899 35.6876 15.5046 11.5560 20.1213 2.4720 76.6828 183.3846 38.1785 69.7873 39.1645 0.2948 54.3807 219.7078 28.2476 49.9188 34.6462 14.6326 17.1828 24.3720 18.8509 4.5870 17.9527 23.8401 274.2909 123.1206 32.0243 0.7970 4.8753 39.9442 59.8844 43.2664 32.2561 111.5252 56.7027 56.5608 82.8813 35.5600 2.0440 24.2134 7.4249 29.9967 6.5256 4.6394 10.5442 40.6914 3.6168 162.3077 140.6173 42.1584 114.1005 0.5831 33.2118 255.4441 20.1872 27.4457 10.9973 19.5857 11.5386 14.1440 4.6917 0.8930 1.3754 35.7506 83.4280 25.1799 2.4638 58.0952
temp: 298.150 k
press: 1.00000 atm
elementType: 8 8 8 8 8 7 7 6 6 6 6 6 6 6 6 6 6 6 1 1 1 1 1 1 1 1 1 1 1 1 1 1
symmnumber: 1
zpe: 644917.7 jmol-1
zpe.correction: 0.245636 hartree
zpe.thermalcorrener: 0.264465 hartree
zpe.thermalcorrenthalpy: 0.265409 hartree
zpe.thermalcorrgfe: 0.195353 hartree
zpe.sumelectzpe: -911.847995 hartree
zpe.sumelectthermal: -911.829166 hartree
zpe.sumelectthermalent: -911.828222 hartree
zpe.sumelectthermalfe: -911.898279 hartree
dipole: -0.1697 0.5133 -1.1789
dipole: 1.2969
quadrupole: -91.5256 -112.0122 -107.9224
quadrupole: -13.9518 -17.5197 10.9021
quadrupole: 12.2945 -8.1922 -4.1023 -13.9518 -17.5197 10.9021
hfenergy: -912.0936314 hartree
pointgroup: C01 [X(C11H14N2O5)]
dipole: 0.0422585 -0.3706864 -0.3480735 debye
polarizability: 181.3058389|-19.4846769|125.9668462|-1.8900942|-17.490569|139.0853899 unknown
InChI: InChI=1S/C11H14N2O5/c12-5-10(16)13-7(11(17)18)3-6-1-2-8(14)9(15)4-6/h1-2,4,7,13-15,17H,3,5,12H2
charge 0 multiplicity 1
32 atoms
O  -3.789404 0.997005 -1.241432
O  -3.310424 2.800632 0.144393
O  4.003464 0.524379 -2.363906
O  4.795314 -0.428327 0.036295
O  -1.425971 -1.191634 1.954371
N  -1.824915 -0.519782 -0.242328
N  -2.005861 -3.935407 1.312855
C  -1.721041 0.910922 0.040776
C  -0.542439 1.616881 -0.708151
C  0.832998 1.008581 -0.456648
C  1.777556 1.004893 -1.515193
C  1.219287 0.506464 0.811166
C  -3.002457 1.675067 -0.296495
C  -1.675714 -1.48142 0.743807
C  3.082108 0.521801 -1.311246
C  2.52968 0.016881 1.02225
C  3.456998 0.028988 -0.033845
C  -1.795261 -2.948306 0.251938
H  -1.569685 1.000671 1.13174
H  -0.754858 1.610699 -1.79502
H  -0.553394 2.678711 -0.390721
H  -2.101059 -0.801214 -1.18502
H  1.515536 1.379945 -2.510371
H  0.504912 0.464264 1.639005
H  2.813943 -0.374644 2.007015
H  -0.85816 -3.193344 -0.286339
H  -2.612654 -3.027854 -0.490767
H  -4.589981 1.546951 -1.45915
H  4.864105 0.153078 -2.034274
H  -2.92436 -3.845225 1.762288
H  -1.267266 -3.894996 2.025156
H  5.024403 -0.760558 0.936554
