program: Gaussian 09
title: 000210809
version: EM64L-G09RevD.01
frameworkgroup: C1[X(C10H14N2O2)]
method: RPBEPBE
basis: SDD
operation: Freq
keyword: #p
keyword: freq=noraman
keyword: PBEPBE/SDD
title: #p freq=noraman PBEPBE/SDD
converged: YES YES NO NO
title: Mulliken charges:
elementType: O O N N C C C C C C C C C C H H H H H H H H H H H H H H
charge: -0.406526 -0.234946 -0.163703 -0.091719 0.088058 -0.516727 -0.416149 -0.402013 -0.460950 0.002823 0.255966 -0.575627 -0.638983 0.213042 0.230335 0.211879 0.205367 0.205638 0.204948 0.206964 0.228120 0.220326 0.256959 0.245020 0.264687 0.261359 0.226144 0.379708
chargesum: 0.00000
title: Mulliken charges with hydrogens summed into heavy atoms:
elementType: O O N N C C C C C C C C C C
charge: -0.026817 -0.234946 -0.163703 -0.091719 0.088058 -0.074513 -0.005144 0.009898 -0.012503 0.002823 0.255966 -0.073648 0.113207 0.213042
polarizability: 1.49918254e+02 6.30581521e+00 1.29883851e+02 3.80289865e+00 -3.42505604e+00 8.86420707e+01
1716.lowfreq: -9.5514 -3.2750 -0.0006 -0.0002 0.0003 15.4936 35.0051 49.7766 75.8318
frequency: 34.7707 49.6726 75.8077 84.0296 95.1977 140.8684 190.6960 192.8094 257.3292 283.5453 308.6489 339.8559 397.2696 410.6470 452.1471 497.2931 528.8705 570.4400 601.4558 611.7087 654.0250 675.2860 698.9961 767.4662 803.6928 821.5589 846.5971 857.1425 907.2277 912.5773 961.9510 970.4913 1013.9290 1059.4120 1079.7563 1090.0439 1124.8375 1128.3564 1132.8626 1156.2708 1202.2362 1213.2887 1236.9658 1249.5194 1268.7767 1285.5489 1306.6493 1318.5880 1328.3502 1338.0238 1347.1585 1368.6569 1424.9114 1447.7300 1455.5214 1463.5485 1464.4204 1468.0861 1474.7662 1477.4598 1489.5052 1498.4903 1571.8325 1658.1276 2954.0398 2972.7774 2978.1377 2980.1914 2983.1865 3018.1926 3029.0103 3037.4092 3041.8679 3050.3777 3076.1668 3104.3438 3132.6308 3506.3103
redmass: 6.8217 5.0933 4.2699 1.0974 2.6554 3.5021 3.0121 3.7124 2.9847 2.4772 2.3135 3.7872 2.4089 4.0268 2.4635 3.6923 3.2840 2.7261 3.3075 4.1832 1.8724 3.7585 3.3716 4.4523 3.6939 1.5937 5.7863 2.3041 1.5035 2.4737 2.4327 2.2092 2.4362 2.2556 1.8669 1.8455 1.2972 2.3033 1.1957 1.5404 1.3775 2.6226 1.2960 1.2791 2.7194 1.5781 1.5863 1.9720 1.4871 1.4460 1.6234 3.3584 1.6588 1.1505 1.2963 1.6436 1.1243 1.1296 1.1470 1.0706 1.3923 2.5229 9.0703 8.3709 1.0650 1.0655 1.0642 1.0610 1.0395 1.0941 1.0611 1.0950 1.0991 1.1038 1.0971 1.1017 1.0995 1.0639
irintensity: 1.3688 0.6211 0.1889 0.2640 1.5965 0.7799 6.7867 2.8996 3.6934 2.8583 0.6529 1.1664 3.4977 2.2324 0.3124 21.9529 20.0011 25.0285 11.7926 8.7289 107.7147 19.2764 20.6220 4.2422 2.0000 6.1808 17.9554 5.4515 2.2451 15.4099 32.1682 2.2591 23.8779 120.3029 2.8329 4.4245 10.6239 44.2051 5.1176 6.6063 6.2011 1.6349 4.4544 1.8064 7.1989 8.6454 4.7824 47.1509 3.9228 0.1430 2.5979 29.0645 3.5955 20.5530 8.5847 20.3962 8.4911 10.9794 15.2096 14.8943 25.2646 19.7361 9.4990 232.1970 36.0359 32.7533 34.2368 34.7237 55.4845 29.5792 15.1149 29.7737 70.2643 67.3191 12.4693 3.5891 2.6967 23.2573
temp: 298.150 k
press: 1.00000 atm
elementType: 8 8 7 7 6 6 6 6 6 6 6 6 6 6 1 1 1 1 1 1 1 1 1 1 1 1 1 1
symmnumber: 1
zpe: 604164.1 jmol-1
zpe.correction: 0.230114 hartree
zpe.thermalcorrener: 0.243574 hartree
zpe.thermalcorrenthalpy: 0.244519 hartree
zpe.thermalcorrgfe: 0.188950 hartree
zpe.sumelectzpe: -648.355281 hartree
zpe.sumelectthermal: -648.341820 hartree
zpe.sumelectthermalent: -648.340876 hartree
zpe.sumelectthermalfe: -648.396445 hartree
dipole: 0.4130 -2.1988 1.1773
dipole: 2.5281
quadrupole: -81.6853 -81.3531 -80.4557
quadrupole: 1.0732 2.8291 4.5038
quadrupole: -0.5206 -0.1884 0.7090 1.0732 2.8291 4.5038
hfenergy: -648.5853946 hartree
pointgroup: C01 [X(C10H14N2O2)]
dipole: -0.2558786 -0.8319268 -0.4813476 debye
polarizability: 148.4020056|-8.35063|131.2770559|3.6383744|4.038519|88.7651139 unknown
InChI: InChI=1S/C10H14N2O2/c1-12-9(6-10(13)14)7-4-2-3-5-8(7)11-12/h13H,2-6H2,1H3
charge 0 multiplicity 1
28 atoms
O  -2.676641 -2.002366 0.397591
O  -3.567439 0.107944 0.788837
N  -0.46431 1.672179 -0.101211
N  0.83412 1.938694 0.33691
C  0.631673 -0.271183 -0.338845
C  1.080717 -1.68866 -0.607931
C  2.429772 -1.95997 0.11532
C  3.436628 -0.79818 -0.089488
C  2.931743 0.518543 0.560872
C  1.488426 0.743942 0.188155
C  -0.614971 0.354955 -0.52515
C  -1.91895 -0.209736 -1.037154
C  -1.453514 2.752526 -0.10889
C  -2.815443 -0.635949 0.121239
H  0.316348 -2.418348 -0.27735
H  1.217232 -1.847646 -1.698454
H  2.245109 -2.087044 1.201105
H  2.862968 -2.909087 -0.253486
H  3.589888 -0.639058 -1.175954
H  4.41954 -1.069662 0.339952
H  3.553329 1.377636 0.247424
H  3.028146 0.445402 1.66328
H  -1.709842 -1.083817 -1.673034
H  -2.472134 0.537604 -1.632371
H  -2.408919 2.403399 0.317217
H  -1.050441 3.568052 0.508825
H  -1.625948 3.134884 -1.132817
H  -3.230386 -2.236853 1.192007
