program: Gaussian 09
title: 000210808
version: EM64L-G09RevD.01
frameworkgroup: C1[X(C15H19N3OS)]
method: RPBEPBE
basis: SDD
operation: Freq
keyword: #p
keyword: freq=noraman
keyword: PBEPBE/SDD
title: #p freq=noraman PBEPBE/SDD
converged: YES YES NO NO
title: Mulliken charges:
elementType: S O N N N C C C C C C C C C C C C C C C H H H H H H H H H H H H H H H H H H H
charge: 0.155296 -0.258416 -0.511971 -0.040677 -0.564788 0.127732 0.421729 0.397948 -0.557650 -0.568029 -0.442662 -0.430902 -0.242345 -0.688638 -0.676966 0.205019 -0.433527 0.350406 -0.767763 -0.160787 0.275507 0.206561 0.222064 0.229099 0.232962 0.234207 0.307262 0.223965 0.216107 0.216401 0.227062 0.202103 0.223987 0.230734 0.232363 0.293945 0.237952 0.333102 0.341610
chargesum: 0.00000
title: Mulliken charges with hydrogens summed into heavy atoms:
elementType: S O N N N C C C C C C C C C C C C C C C
charge: 0.155296 -0.258416 -0.204710 -0.040677 0.109924 0.127732 0.421729 0.397948 -0.075582 -0.116866 -0.209700 -0.196695 -0.018380 -0.029069 -0.020142 0.205019 -0.433527 0.350406 -0.003504 -0.160787
polarizability: 3.05511128e+02 -7.40327167e+00 1.90983534e+02 -6.31139123e+00 1.08129202e+01 1.53569876e+02
1716.lowfreq: -5.3923 -2.0120 0.0004 0.0013 0.0014 5.5813 20.8752 29.4795 41.2447
frequency: 20.8027 29.4627 41.2422 60.0101 71.6928 84.5595 97.7724 104.4123 114.3025 145.9407 161.4512 188.2173 198.8716 204.7999 213.1013 264.2305 281.9545 293.9788 296.0628 333.3476 336.3863 351.1366 375.0520 379.1299 421.2607 450.6177 465.2956 503.5268 519.3704 530.5277 539.2598 572.2503 575.8303 582.0334 604.5394 621.0359 625.2984 672.0650 714.9101 743.2979 775.4395 789.8715 804.0460 814.9539 839.3107 881.1276 908.5730 920.9778 967.6300 975.8627 981.1192 1004.6453 1033.2496 1046.2469 1055.0846 1059.0531 1067.7415 1086.4224 1091.8866 1111.6073 1176.3304 1209.8447 1232.8108 1243.9815 1248.1631 1264.5776 1268.9453 1285.3533 1317.6231 1321.7843 1327.4021 1374.1030 1382.5942 1390.1981 1392.6211 1434.2531 1447.3637 1456.5060 1467.0565 1472.0400 1473.1357 1477.4556 1483.9637 1485.3667 1488.2891 1497.9614 1536.4074 1561.4815 1579.0862 1599.4588 1602.2744 1626.2706 2972.8968 2979.3644 2990.4725 2992.6522 2998.1205 3040.4754 3051.6421 3066.0960 3067.9403 3075.5109 3083.4310 3085.6904 3116.9632 3126.1449 3138.3706 3153.6272 3496.8028 3552.1458 3704.5796
redmass: 4.5142 4.3706 4.0771 3.5997 3.5476 3.4651 3.6190 1.5651 2.0671 4.5949 3.1371 1.4814 3.5410 1.1191 2.0344 5.8996 4.7294 3.1276 3.1692 1.7295 1.7028 2.9817 4.4462 4.3695 5.4985 1.2853 2.7021 6.6050 4.3796 2.7219 3.6473 3.8591 3.1224 1.9708 5.9774 3.8797 5.7267 5.0346 8.1711 2.9454 1.3331 1.1999 1.4763 4.2294 4.2441 2.9941 1.3581 3.4556 2.3780 1.3811 2.7965 2.4202 2.0059 1.5102 2.3415 2.0010 1.9198 1.6895 2.1572 1.6002 1.1739 3.3689 1.4206 2.4912 1.5360 1.6680 2.2618 1.9601 1.4942 6.0903 1.7213 4.8609 1.2199 1.2088 1.2506 1.6520 1.4516 2.8723 1.2768 1.2002 1.0576 1.0613 1.0694 1.3597 1.1023 1.1237 4.2850 3.0133 3.4248 5.7840 6.5057 1.7948 1.0362 1.0348 1.0382 1.0604 1.0621 1.0995 1.0994 1.0994 1.0968 1.0994 1.1009 1.1010 1.0857 1.0916 1.0990 1.0992 1.0761 1.0453 1.1046
irintensity: 0.5078 0.4766 1.5029 1.9363 1.0678 0.5403 0.6839 0.4371 1.8416 2.0945 0.7980 0.6944 7.5477 0.0166 1.5931 1.6001 2.0407 10.7874 4.1002 25.9775 26.3846 9.2785 5.0230 9.1014 3.4311 213.5048 21.4364 14.1312 3.3025 30.4366 8.8316 7.2443 3.6291 67.6005 17.4531 0.2917 0.7809 10.2935 17.9580 36.5583 23.3768 4.9005 31.2298 16.5005 3.2938 16.1302 0.5229 11.6050 0.0328 2.7595 15.1593 1.4715 2.2139 6.4012 28.8683 12.7878 14.7316 5.8398 10.4191 23.8768 3.0250 6.3242 2.5916 37.8654 0.9952 1.5414 70.3621 242.2733 3.6462 108.4828 0.8290 40.0932 10.8224 32.7310 49.1991 28.2236 92.8621 135.3821 21.7223 53.9159 7.0897 16.8116 26.4921 113.0030 17.2772 55.7021 221.4289 248.3750 29.5180 12.2938 6.3144 434.1161 27.9386 40.8210 23.1808 27.0711 34.5256 3.0544 1.3986 80.5603 14.1965 39.1205 35.8216 45.4213 1.0662 25.7463 1.8046 40.3253 18.0964 166.1830 48.1142
temp: 298.150 k
press: 1.00000 atm
elementType: 16 8 7 7 7 6 6 6 6 6 6 6 6 6 6 6 6 6 6 6 1 1 1 1 1 1 1 1 1 1 1 1 1 1 1 1 1 1 1
symmnumber: 1
zpe: 824355.7 jmol-1
zpe.correction: 0.313981 hartree
zpe.thermalcorrener: 0.335163 hartree
zpe.thermalcorrenthalpy: 0.336107 hartree
zpe.thermalcorrgfe: 0.262815 hartree
zpe.sumelectzpe: -1219.083983 hartree
zpe.sumelectthermal: -1219.062801 hartree
zpe.sumelectthermalent: -1219.061857 hartree
zpe.sumelectthermalfe: -1219.135149 hartree
dipole: -2.4791 3.9719 3.0797
dipole: 5.6042
quadrupole: -101.5631 -120.5629 -127.8024
quadrupole: -7.5310 -9.2313 -0.8225
quadrupole: 15.0797 -3.9201 -11.1596 -7.5310 -9.2313 -0.8225
hfenergy: -1219.3979635 hartree
pointgroup: C01 [X(C15H19N3O1S1)]
dipole: 0.9038004 -1.4401447 1.4037457 debye
polarizability: 304.1621847|-4.7523397|188.6744066|16.4041134|-14.1763213|157.2279466 unknown
InChI: InChI=1S/C15H19N3OS/c1-4-10-7-6-8-11(5-2)12(10)18-14(19)13-9(3)17-15(16)20-13/h6-8,18H,4-5,16H2,1-3H3
charge 0 multiplicity 1
39 atoms
S  2.405135 -0.649109 1.427632
O  0.312637 1.498511 -1.353689
N  -0.370242 -0.128207 0.188945
N  4.380635 0.286743 -0.127834
N  5.169547 -0.968729 1.74486
C  -1.793439 -0.028583 -0.020047
C  -2.491364 1.189465 0.235719
C  -2.482658 -1.203439 -0.44869
C  -1.80685 2.435467 0.779408
C  -1.742777 -2.510624 -0.705563
C  -3.891988 1.208278 0.018001
C  -3.885089 -1.142506 -0.628847
C  -4.590535 0.058205 -0.405882
C  -1.376146 2.29382 2.264589
C  -1.530891 -3.358225 0.580064
C  0.608024 0.62643 -0.473477
C  2.006284 0.336032 -0.082721
C  3.187527 0.724174 -0.723576
C  3.297258 1.542135 -1.981538
C  4.175816 -0.428492 0.968946
H  -0.92904 2.685394 0.158536
H  -2.508484 3.286618 0.693787
H  -2.32204 -3.114575 -1.428098
H  -0.763111 -2.306971 -1.1783
H  -4.437677 2.142014 0.199468
H  -4.418138 -2.039841 -0.965906
H  -0.048977 -0.941088 0.721841
H  -5.674043 0.099141 -0.56346
H  -2.247986 2.092363 2.913667
H  -0.892448 3.2237 2.616234
H  -0.655028 1.467355 2.392571
H  -0.933007 -2.821695 1.342156
H  -1.004677 -4.301906 0.346948
H  -2.500775 -3.607662 1.046353
H  3.875549 0.982894 -2.739287
H  2.303178 1.799774 -2.370901
H  3.855062 2.473088 -1.769956
H  4.970565 -1.513338 2.578489
H  6.134594 -0.800313 1.467158
