program: Gaussian 09
title: 000210806
version: EM64L-G09RevD.01
frameworkgroup: C1[X(C12H14ClN3)]
method: RPBEPBE
basis: SDD
operation: Freq
keyword: #p
keyword: freq=noraman
keyword: PBEPBE/SDD
title: #p freq=noraman PBEPBE/SDD
converged: YES YES NO NO
title: Mulliken charges:
elementType: Cl N N N C C C C C C C C C C C C H H H H H H H H H H H H H H
charge: 0.002608 -0.204068 -0.182507 -0.087301 0.293522 0.125258 -0.258350 0.470089 -0.769227 -0.628292 -0.625211 -0.364377 -0.378830 -0.213374 -0.207523 -0.249255 0.226675 0.242211 0.246469 0.219120 0.214485 0.240582 0.218982 0.238078 0.214546 0.256670 0.273794 0.226976 0.228530 0.229721
chargesum: 0.00000
title: Mulliken charges with hydrogens summed into heavy atoms:
elementType: Cl N N N C C C C C C C C C C C C
charge: 0.002608 -0.204068 -0.182507 -0.087301 0.293522 0.125258 -0.258350 0.470089 -0.053872 0.045896 0.046395 -0.107707 -0.105037 0.013602 0.021007 -0.019534
polarizability: 2.52404898e+02 7.10096535e+00 1.62783012e+02 -2.36760715e+00 9.31807149e+00 8.89656895e+01
1716.lowfreq: -5.1304 -0.0016 0.0011 0.0019 3.8946 7.8006 44.1509 45.1425 62.2626
frequency: 44.1031 45.1277 62.2386 92.5350 124.9247 135.5146 142.4481 176.9681 181.8066 203.1640 231.9962 241.5287 262.1600 276.3944 293.7871 356.9603 382.9413 409.0351 412.3555 444.7386 506.9839 580.0968 601.2307 611.5895 621.1415 663.0406 694.7122 697.1233 764.8160 783.0384 841.0213 915.1840 942.8838 958.3480 972.9145 987.8985 989.3106 991.8731 1024.2142 1043.0725 1053.2454 1065.3419 1090.7251 1093.8682 1133.4285 1137.1001 1171.9109 1183.7556 1195.1237 1220.5801 1301.8765 1324.8010 1357.6633 1385.1810 1386.8049 1394.7877 1425.5748 1439.0216 1447.3260 1453.3693 1462.1000 1467.6357 1469.9524 1480.7347 1485.0011 1488.2697 1505.2964 1574.9628 1595.8907 1611.8239 2907.0289 2925.9507 2976.7393 3014.7395 3021.1254 3056.9059 3090.1469 3095.1393 3102.9898 3131.0034 3142.1809 3161.0108 3178.4036 3183.3627
redmass: 3.8108 4.4217 3.2987 4.4369 2.6565 1.7541 1.1862 2.9528 2.2001 3.2504 1.2035 3.5747 3.0359 4.0964 5.8475 6.0585 3.3161 3.0048 4.4342 5.9074 3.4795 4.4930 7.5901 5.3973 7.0439 6.3586 2.6317 3.6117 1.7076 5.7786 1.2475 1.4179 4.3575 5.4748 1.4046 5.4881 1.5935 1.4722 2.2827 1.4783 1.4848 2.7677 1.2414 1.8659 2.1250 1.5648 1.0549 1.4461 2.4507 4.5358 3.0825 1.4094 5.5765 4.0929 8.4457 1.3544 1.1344 1.2332 2.3546 1.1757 1.0731 1.0862 1.5241 1.2591 1.1525 1.6152 2.2268 5.0939 6.6830 6.1239 1.0513 1.0462 1.0393 1.0886 1.0829 1.0945 1.0977 1.0981 1.0990 1.0852 1.0903 1.0959 1.0947 1.0976
irintensity: 0.1144 2.3810 3.5832 1.2557 1.2089 1.3345 0.8744 1.3325 1.5991 0.6889 0.3983 0.2448 3.0121 4.1790 8.3875 2.3928 2.1905 1.4838 1.6802 6.2682 14.0384 0.8511 1.8816 5.3032 2.9873 16.5748 22.2086 19.1615 65.4647 8.7078 0.0852 4.8920 69.1496 13.0635 1.8052 0.3265 0.4847 0.8271 1.8003 7.1960 13.8422 24.1511 16.8815 22.1733 69.0781 1.0350 0.4532 12.8784 20.0286 15.2464 8.7345 10.7079 139.5977 38.2176 21.4770 24.2013 8.5954 9.4180 5.6442 4.8384 16.6343 13.2660 54.1430 17.6279 34.0269 84.4770 113.7848 84.8982 7.4332 73.9691 115.7424 123.1950 37.5631 65.7899 31.5904 18.8900 17.8794 39.8219 5.0435 0.6262 17.8690 35.9064 6.8234 2.0548
temp: 298.150 k
press: 1.00000 atm
elementType: 17 7 7 7 6 6 6 6 6 6 6 6 6 6 6 6 1 1 1 1 1 1 1 1 1 1 1 1 1 1
symmnumber: 1
zpe: 622662.9 jmol-1
zpe.correction: 0.237160 hartree
zpe.thermalcorrener: 0.253063 hartree
zpe.thermalcorrenthalpy: 0.254008 hartree
zpe.thermalcorrgfe: 0.193376 hartree
zpe.sumelectzpe: -1088.778302 hartree
zpe.sumelectthermal: -1088.762398 hartree
zpe.sumelectthermalent: -1088.761454 hartree
zpe.sumelectthermalfe: -1088.822086 hartree
dipole: 1.4829 -0.6774 0.3100
dipole: 1.6595
quadrupole: -83.3258 -98.2322 -103.8357
quadrupole: 1.5702 0.7268 5.1306
quadrupole: 11.8055 -3.1010 -8.7045 1.5702 0.7268 5.1306
hfenergy: -1089.0154619 hartree
pointgroup: C01 [X(C12H14Cl1N3)]
dipole: 0.5809506 0.2729779 -0.1194915 debye
polarizability: 252.5214694|-6.4184396|162.3422678|1.5893504|10.6046734|89.2898623 unknown
InChI: InChI=1S/C12H14ClN3/c1-9-11(15(2)3)12(13)16(14-9)10-7-5-4-6-8-10/h4-8H,1-3H3
charge 0 multiplicity 1
30 atoms
Cl 0.555808 2.418075 -0.418838
N  -0.257552 -0.238321 0.049095
N  3.33619 0.454799 0.10919
N  0.25155 -1.543242 0.175524
C  2.009637 -0.024837 0.067793
C  1.607661 -1.406231 0.199613
C  0.791183 0.675337 -0.042026
C  -1.677995 -0.057996 0.027988
C  2.494193 -2.602761 0.383476
C  4.251513 0.058204 -0.976141
C  3.621434 1.765181 0.714983
C  -2.283403 1.098715 0.577502
C  -2.477522 -1.088373 -0.527009
C  -3.688419 1.23192 0.538759
C  -3.879746 -0.947778 -0.546226
C  -4.49348 0.214912 -0.02259
H  2.915115 -2.961196 -0.575806
H  3.342487 -2.349491 1.044445
H  1.921442 -3.432378 0.8297
H  5.298198 0.130614 -0.625957
H  4.144289 0.697648 -1.882755
H  4.060579 -0.985786 -1.272991
H  4.666808 1.770798 1.078843
H  2.955646 1.928543 1.578549
H  3.49605 2.620714 0.014875
H  -1.673392 1.877244 1.042049
H  -1.987836 -1.982261 -0.921391
H  -4.152917 2.128841 0.962988
H  -4.494016 -1.746671 -0.975879
H  -5.583107 0.32317 -0.045864
