program: Gaussian 09
title: 000210805
version: EM64L-G09RevD.01
frameworkgroup: C1[X(C14H21N)]
method: RPBEPBE
basis: SDD
operation: Freq
keyword: #pfreq=noraman
keyword: PBEPBE/SDD
title: #p freq=noraman PBEPBE/SDD
converged: YES YES NO NO
title: Mulliken charges:
elementType: N C C C C C C C C C C C C C C H H H H H H H H H H H H H H H H H H H H H
charge: -0.102718 0.166403 -0.509143 -0.003906 -0.635509 0.315493 0.280302 -0.739901 -0.741134 -0.399761 -0.408921 -0.640350 -0.633512 -0.275151 -0.255970 0.201601 0.222195 0.193161 0.230254 0.241860 0.208076 0.210830 0.226695 0.224821 0.210959 0.219655 0.226553 0.232938 0.247300 0.216364 0.187277 0.217011 0.230319 0.186578 0.224113 0.225219
chargesum: 0.00000
title: Mulliken charges with hydrogens summed into heavy atoms:
elementType: N C C C C C C C C C C C C C C
charge: -0.102718 0.166403 -0.085347 0.189255 -0.163396 0.315493 0.280302 -0.094300 -0.085699 -0.173208 -0.175982 0.010591 0.000395 -0.051038 -0.030750
polarizability: 1.89773742e+02 3.93865426e+00 1.64663689e+02 -2.96745942e+00 1.30123280e+00 1.03215063e+02
1716.lowfreq: -16.1553 -11.7912 -4.4464 -0.0006 -0.0006 -0.0005 35.6175 66.2471 104.4775
frequency: 35.1026 66.2250 104.4633 108.0631 157.5415 173.7359 203.7203 223.2052 240.2816 241.7771 265.0988 294.3096 308.1840 317.9987 333.7113 364.7213 374.3542 445.2808 458.1687 471.7254 493.7111 529.4570 545.5586 560.3991 607.7151 693.4179 737.9477 767.5773 809.3574 826.3781 855.2538 872.3083 890.8084 908.1409 927.3823 950.8559 959.4260 984.5978 993.8495 1019.5814 1027.5117 1039.3554 1049.5513 1080.0214 1082.9666 1111.5477 1124.6524 1133.1727 1138.6215 1174.7891 1185.0425 1200.1155 1207.9774 1211.2541 1234.8838 1248.3597 1264.6640 1286.9673 1308.4456 1316.5822 1341.2294 1370.0230 1375.4365 1378.5756 1396.3321 1418.4306 1435.4657 1445.8753 1451.7938 1459.7977 1463.7404 1468.6318 1469.0739 1475.2950 1478.6174 1481.3824 1483.9388 1489.6188 1492.2787 1587.3043 1612.2741 2823.7145 2844.3760 2860.1428 2961.1234 2970.6243 2975.7206 2986.0439 3032.3687 3035.6423 3036.9821 3050.7440 3064.4433 3069.7763 3076.6937 3082.1843 3090.0778 3094.5578 3108.9707 3121.8733 3137.5725 3157.9424
redmass: 2.6556 3.0991 2.8897 2.6348 2.6697 1.2425 1.2785 1.5998 1.3850 1.1114 2.3659 2.6801 2.4430 3.4289 2.7985 3.1124 2.3404 3.1919 2.5108 2.4813 2.6536 2.9319 2.7621 3.3045 5.3619 4.5624 2.1462 1.5953 4.1058 3.6529 1.8594 1.5351 2.2781 2.0024 1.5205 1.4384 1.9213 1.3277 1.4761 1.6851 1.5696 2.4492 2.1760 2.0808 1.3989 2.5006 1.6195 1.6940 1.4943 1.0737 2.0257 2.3533 2.1296 2.3914 1.7561 2.1289 1.6594 1.7968 1.5761 1.3144 1.5760 1.6758 1.2243 3.7659 1.2189 1.1401 2.2283 1.1703 1.1041 1.0834 1.0701 1.0840 1.0819 1.1292 1.1340 1.0583 1.1114 1.0697 1.5376 6.7731 6.2446 1.0791 1.0577 1.0580 1.0635 1.0353 1.0365 1.0603 1.0791 1.0764 1.0860 1.0993 1.0992 1.0983 1.0999 1.0993 1.0989 1.0991 1.0870 1.0865 1.0930 1.1005
irintensity: 0.6644 0.1954 0.6811 0.2346 0.0984 0.3892 0.5426 1.0988 0.2770 0.0955 0.3597 3.9033 0.0689 0.1558 5.8853 0.1943 0.3594 6.0162 0.8488 1.2885 5.9653 0.2590 2.6368 2.2526 4.2615 1.0943 20.7123 50.6043 2.2908 8.4332 5.5987 4.8205 4.0624 7.1373 0.5170 5.1170 11.2105 0.0818 9.9467 18.4233 11.6787 9.0411 14.5831 8.0153 5.5728 3.3981 2.3965 5.0414 10.6665 0.1178 3.3592 4.0720 1.6205 2.2643 3.6629 12.1899 0.6788 5.8027 5.4106 2.5698 4.1901 35.9139 18.0009 0.6531 10.5676 2.4641 14.2389 10.8272 6.3618 5.6748 0.7237 12.7178 4.6056 9.8897 14.1372 4.5055 5.1190 21.0501 48.9055 2.2039 1.3064 52.0690 65.1577 198.4557 18.8895 34.2429 29.1804 32.5703 15.7456 57.7824 43.3953 28.2445 4.8289 86.0146 26.0407 41.9162 37.3768 36.4492 13.0040 2.7917 37.5135 35.7103
temp: 298.150 k
press: 1.00000 atm
elementType: 7 6 6 6 6 6 6 6 6 6 6 6 6 6 6 1 1 1 1 1 1 1 1 1 1 1 1 1 1 1 1 1 1 1 1 1
symmnumber: 1
zpe: 829637.5 jmol-1
zpe.correction: 0.315992 hartree
zpe.thermalcorrener: 0.331200 hartree
zpe.thermalcorrenthalpy: 0.332144 hartree
zpe.thermalcorrgfe: 0.274638 hartree
zpe.sumelectzpe: -599.674617 hartree
zpe.sumelectthermal: -599.659410 hartree
zpe.sumelectthermalent: -599.658465 hartree
zpe.sumelectthermalfe: -599.715972 hartree
dipole: 0.7029 0.1979 0.7879
dipole: 1.0742
quadrupole: -87.5167 -86.3871 -97.5216
quadrupole: -0.8446 1.8619 -0.0425
quadrupole: 2.9584 4.0881 -7.0465 -0.8446 1.8619 -0.0425
hfenergy: -599.9906092 hartree
pointgroup: C01 [X(C14H21N1)]
dipole: -0.2768135 0.0653005 -0.3126208 debye
polarizability: 190.1793145|-2.5311115|164.3321698|-1.9299658|-1.0031704|103.1410101 unknown
InChI: InChI=1S/C14H21N/c1-14(2)10-12(15(3)4)9-11-7-5-6-8-13(11)14/h5-8,12H,9-10H2,1-4H3
charge 0 multiplicity 1
36 atoms
N  -3.048053 -0.57693 0.217293
C  0.212268 1.583177 0.048353
C  -1.1909 1.086103 0.504976
C  -1.643425 -0.228585 -0.168821
C  -0.657881 -1.333823 0.268208
C  1.226145 0.421183 0.024733
C  0.806809 -0.936936 0.109577
C  0.659705 2.691217 1.045707
C  0.118879 2.207412 -1.378639
C  2.61221 0.694963 -0.121972
C  1.780691 -1.968242 0.055364
C  -3.459073 -1.930959 -0.224187
C  -4.034472 0.423877 -0.253184
C  3.572832 -0.335103 -0.168942
C  3.154046 -1.682716 -0.076872
H  -1.907829 1.903516 0.308383
H  -1.189651 0.911667 1.59961
H  -1.575634 -0.11301 -1.284244
H  -0.826517 -2.265322 -0.30197
H  -0.873961 -1.565942 1.332501
H  1.597526 3.181036 0.728286
H  -0.118037 3.475588 1.112566
H  0.816921 2.273612 2.056618
H  -0.228455 1.468451 -2.12258
H  -0.587087 3.059968 -1.379348
H  1.104929 2.578271 -1.712382
H  2.949268 1.735239 -0.198192
H  1.447947 -3.012494 0.117468
H  -2.849784 -2.70547 0.26825
H  -4.509649 -2.098925 0.071965
H  -3.386107 -2.078746 -1.332543
H  -5.046934 0.101636 0.04745
H  -3.852048 1.40732 0.208377
H  -4.030168 0.555155 -1.366118
H  4.635571 -0.091433 -0.27849
H  3.88692 -2.496456 -0.113803
