program: Gaussian 09
title: 000210803
version: EM64L-G09RevD.01
frameworkgroup: C1[X(C12H18N2O2)]
method: RPBEPBE
basis: SDD
operation: Freq
keyword: #p
keyword: freq=noraman
keyword: PBEPBE/SDD
title: #p freq=noraman PBEPBE/SDD
converged: YES YES NO NO
title: Mulliken charges:
elementType: O O N N C C C C C C C C C C C C H H H H H H H H H H H H H H H H H H
charge: -0.255324 -0.277718 -0.229669 -0.171933 0.283764 -0.472625 0.106956 -0.281101 0.230000 -0.373578 -0.312019 -0.439433 -0.690557 -0.677104 -0.016410 -0.577136 0.188517 0.221831 0.274522 0.245815 0.198936 0.247854 0.242600 0.271275 0.230374 0.218197 0.204844 0.220795 0.238599 0.239244 0.219947 0.244617 0.225295 0.220627
chargesum: 0.00000
title: Mulliken charges with hydrogens summed into heavy atoms:
elementType: O O N N C C C C C C C C C C C C
charge: -0.255324 -0.277718 -0.229669 -0.171933 0.283764 -0.062277 0.106956 -0.006579 0.230000 0.071173 0.178435 0.062216 -0.046721 0.020686 0.228207 -0.131215
polarizability: 1.79495322e+02 9.87929566e+00 1.78414867e+02 -8.46737861e-01 3.53765620e+00 1.01307394e+02
1716.lowfreq: -7.7872 -0.0004 0.0005 0.0005 4.6110 7.7824 29.3184 41.5738 44.8564
frequency: 29.3069 41.4445 44.8088 64.5199 72.8603 75.2039 87.8049 108.6129 165.8451 175.9470 214.4326 231.5602 255.4307 273.4805 290.0165 304.3153 353.0225 361.2683 383.3309 396.9753 416.5763 472.2491 508.8612 539.8917 585.1138 630.2227 681.9130 714.4708 738.4812 754.0367 771.1548 775.8390 863.5514 872.0589 891.4689 901.5824 910.3843 937.1412 956.2925 966.5135 1007.5861 1026.3637 1050.7122 1062.9868 1092.5074 1094.8653 1097.4137 1121.7371 1151.0777 1197.8453 1226.5833 1233.2381 1245.2706 1278.6047 1283.2308 1288.5297 1298.4317 1339.2311 1340.2016 1346.2283 1364.3389 1368.0629 1386.2488 1387.0629 1415.0555 1429.4716 1446.1496 1454.9521 1469.8467 1473.0484 1474.8130 1477.9703 1481.8617 1485.1387 1570.0119 1621.9630 1652.8638 1658.6812 2972.0388 2978.1116 2987.3611 2992.7703 3001.6207 3030.3486 3043.8432 3050.2061 3064.0631 3073.7614 3076.3148 3089.9881 3090.6576 3092.7873 3110.1312 3119.6994 3155.6854 3202.0384
redmass: 3.2465 3.3632 2.6264 4.8362 2.1710 2.4603 3.1854 3.8950 3.6305 4.2434 1.1005 1.1446 2.7632 2.4769 2.8919 3.8529 4.6627 2.8388 2.9439 4.7824 4.1255 6.5999 2.4300 4.0915 2.9796 3.2427 2.4827 9.2524 1.4091 3.3247 6.0180 1.2588 1.4667 1.9758 2.2652 1.7138 1.5548 2.1131 1.5817 1.6969 1.1882 2.9110 3.0091 2.6692 1.7051 2.0172 2.0518 2.4433 2.2897 2.2423 1.6852 1.4337 3.0257 1.4375 1.2732 1.1383 1.7604 1.3225 1.4117 1.6409 1.5016 1.5036 1.2238 1.2111 3.0131 1.1968 1.1676 1.1118 1.1120 1.0455 1.0537 1.0447 1.0502 1.0778 8.9398 9.3406 6.9632 4.7116 1.0358 1.0589 1.0633 1.0352 1.0597 1.0971 1.0598 1.1016 1.1020 1.0998 1.1014 1.0607 1.0980 1.1017 1.0950 1.1059 1.0936 1.1141
irintensity: 0.1637 0.1642 0.4393 1.2157 0.4752 0.3395 2.9537 5.3026 0.2868 1.1883 0.4480 0.1113 2.0149 1.2408 1.5976 3.7314 13.5805 10.1543 0.5869 7.9173 17.9512 5.9169 2.6710 4.9297 11.1705 2.7533 7.0206 5.1142 13.6280 8.5361 17.4686 7.0524 5.6218 8.1877 7.1436 15.4022 0.7269 4.3221 40.8446 55.0367 30.5052 4.5421 3.6743 10.1748 9.8347 11.0156 15.6320 7.7247 33.8860 7.7971 7.2027 33.4815 24.8993 42.1596 0.9758 6.2911 87.8607 3.1199 9.7765 30.9369 17.7968 36.3002 17.8711 10.0850 99.8208 10.8223 71.4050 4.6141 73.9160 13.9922 4.6943 13.7404 8.3358 14.8330 404.7776 200.4167 210.1912 38.1690 40.4901 16.0584 46.2710 23.8784 43.3301 4.0077 13.9401 0.5636 9.4161 53.6941 57.4305 11.0573 38.2371 9.8270 7.3946 7.3988 4.6998 19.8451
temp: 298.150 k
press: 1.00000 atm
elementType: 8 8 7 7 6 6 6 6 6 6 6 6 6 6 6 6 1 1 1 1 1 1 1 1 1 1 1 1 1 1 1 1 1 1
symmnumber: 1
zpe: 743775.8 jmol-1
zpe.correction: 0.283289 hartree
zpe.thermalcorrener: 0.300703 hartree
zpe.thermalcorrenthalpy: 0.301647 hartree
zpe.thermalcorrgfe: 0.236390 hartree
zpe.sumelectzpe: -726.815748 hartree
zpe.sumelectthermal: -726.798334 hartree
zpe.sumelectthermalent: -726.797390 hartree
zpe.sumelectthermalfe: -726.862647 hartree
dipole: -1.1156 -3.8510 0.0764
dipole: 4.0100
quadrupole: -106.7272 -89.7773 -94.3403
quadrupole: 3.5104 1.7017 2.1475
quadrupole: -9.7789 7.1710 2.6079 3.5104 1.7017 2.1475
hfenergy: -727.099037 hartree
pointgroup: C01 [X(C12H18N2O2)]
dipole: -0.3128316 -1.5462628 -0.015366 debye
polarizability: 177.8452165|9.6717119|179.8428011|1.7240198|5.5521719|101.5295662 unknown
InChI: InChI=1S/C12H18N2O2/c1-4-7-10-9-13(8-5-2)12(16)14(6-3)11(10)15/h5,9H,2,4,6-8H2,1,3H3
charge 0 multiplicity 1
34 atoms
O  2.014467 1.837339 -0.281642
O  -2.657761 1.360855 -0.138024
N  -0.319639 1.594106 -0.224712
N  -1.328698 -0.557441 -0.407016
C  1.100852 -0.39871 -0.471228
C  2.473441 -1.029468 -0.561311
C  1.011507 1.060373 -0.321724
C  -0.062508 -1.129625 -0.508943
C  -1.508947 0.838965 -0.247264
C  3.228358 -1.053208 0.797704
C  -0.462497 3.068273 -0.054904
C  -2.54566 -1.416642 -0.482838
C  4.637967 -1.665897 0.663429
C  -0.500703 3.475129 1.430826
C  -2.594112 -2.447029 0.625522
C  -2.731617 -3.780058 0.418009
H  2.385676 -2.063511 -0.949618
H  3.085583 -0.454228 -1.282769
H  -0.053377 -2.21898 -0.60926
H  3.302837 -0.017167 1.175874
H  2.633718 -1.628773 1.53461
H  0.405252 3.525029 -0.557132
H  -1.393905 3.366784 -0.562069
H  -3.39961 -0.719124 -0.408442
H  -2.581811 -1.907209 -1.473414
H  5.257076 -1.079268 -0.040844
H  4.590407 -2.705476 0.286016
H  5.160415 -1.683461 1.637175
H  -1.366183 3.018656 1.941156
H  0.427671 3.170285 1.943499
H  -0.593501 4.573185 1.513197
H  -2.535232 -2.048755 1.648655
H  -2.800161 -4.485903 1.252556
H  -2.796104 -4.201844 -0.593376
