program: Gaussian 09
title: 000216198
version: EM64L-G09RevD.01
frameworkgroup: C1[X(C12H16N2O5)]
method: RPBEPBE
basis: SDD
operation: Freq
keyword: #p
keyword: freq=noraman
keyword: PBEPBE/SDD
title: #p freq=noraman PBEPBE/SDD
converged: YES YES NO NO
title: Mulliken charges:
elementType: O O O O O N N C C C C C C C C C C C C H H H H H H H H H H H H H H H H
charge: -0.439006 -0.254421 -0.209922 -0.444901 -0.403944 -0.383433 -0.691136 -0.158805 -0.626226 0.596274 -0.195423 0.251251 0.163623 -0.507159 -0.459866 0.155986 -0.688312 -0.349898 0.131163 0.317609 0.221393 0.244706 0.321875 0.231208 0.231804 0.231019 0.226282 0.245086 0.220073 0.210223 0.305045 0.344853 0.389936 0.425618 0.347426
chargesum: 0.00000
title: Mulliken charges with hydrogens summed into heavy atoms:
elementType: O O O O O N N C C C C C C C C C C C C
charge: -0.049070 -0.254421 -0.209922 -0.019284 -0.056518 -0.061558 -0.041238 0.158804 -0.160127 0.596274 0.035785 0.251251 0.163623 -0.275355 -0.228847 0.155986 0.003129 -0.139676 0.131163
polarizability: 2.05022233e+02 -6.96037126e+00 1.76196066e+02 -1.53434562e+01 -1.80327794e+01 1.13294461e+02
1716.lowfreq: -10.1735 0.0006 0.0010 0.0011 3.0514 5.9117 37.0106 39.6098 52.4754
frequency: 37.0032 39.5946 52.4360 68.8846 83.2107 98.1305 120.3849 145.7603 148.7261 200.0484 215.9007 230.7546 252.6499 262.8701 287.8107 294.6251 309.5752 328.0667 351.2604 370.8177 410.6407 439.2885 453.6340 471.5628 478.3271 518.2365 541.5324 556.5209 569.1006 595.7632 604.5162 636.1622 665.7931 685.8404 702.2690 728.6321 740.8630 766.5617 785.1805 821.5219 855.4163 864.0081 885.2406 900.2927 909.5588 928.8986 948.9905 989.9003 1011.4787 1062.9356 1070.9966 1084.4077 1089.0983 1113.6902 1154.1884 1156.8024 1172.3107 1178.9986 1203.7140 1235.2806 1239.4255 1250.0332 1265.4591 1287.9271 1292.6360 1301.2630 1304.4410 1324.0732 1368.9686 1388.5662 1391.9094 1416.3736 1459.7427 1465.5723 1475.1747 1477.6359 1497.7330 1535.5957 1589.2144 1602.4963 1624.8733 1647.5607 1674.2865 2508.1130 2980.0775 2983.2363 2999.4074 3054.8859 3076.4833 3077.2505 3092.7377 3104.7157 3137.0347 3142.7198 3354.2464 3489.7672 3523.1647 3543.4582 3569.1239
redmass: 8.8471 5.6127 6.5710 3.5297 5.3065 6.2410 6.0271 5.2275 4.8387 4.7034 3.2730 1.3397 2.8846 4.6412 3.3814 5.0222 4.6715 3.8705 1.1746 3.7965 3.4298 2.4841 2.8761 3.0671 2.8059 2.6529 3.6332 2.4116 4.8614 1.7491 1.4932 3.3745 3.0033 3.7508 5.6074 4.3540 5.3513 5.4521 1.5089 3.9056 2.4850 2.0460 1.9718 1.3704 2.2756 1.3421 3.5707 2.8478 1.5900 2.9482 3.1037 2.1704 2.0456 1.2096 1.4002 1.4502 1.4943 1.3452 1.5417 1.9128 1.8141 1.3984 2.3544 1.6177 1.6067 1.2877 1.5103 1.5798 1.5028 1.3291 3.8033 3.5933 1.1335 1.0528 1.1928 1.5197 1.7949 2.1291 1.7980 6.1367 3.6643 1.9878 9.0604 1.0779 1.0355 1.0619 1.0858 1.0985 1.0998 1.0873 1.1008 1.0879 1.0925 1.0931 1.0497 1.0901 1.0643 1.0774 1.0658
irintensity: 4.6582 1.8480 0.8840 1.6782 3.2237 0.8817 0.5992 4.8815 0.2875 9.3971 9.9795 2.2361 2.5463 7.0396 14.9990 6.5582 18.7850 15.2431 105.4796 21.4514 4.2696 5.1441 17.9253 3.4137 9.2822 19.2086 11.6026 21.8978 3.2826 69.0419 179.6616 72.5368 1.1551 23.2195 9.7267 4.7185 5.0762 5.5345 54.1019 47.3342 13.0415 13.0429 51.2764 3.3403 192.7583 77.2718 5.1153 9.1808 0.9505 107.7680 14.9583 6.5834 308.6865 73.0152 27.9084 22.7106 36.5701 34.5348 12.4263 76.6523 13.4680 9.7760 220.1496 40.1695 3.7572 4.2604 15.3757 19.0874 4.9213 16.1628 0.3039 28.7353 36.7306 14.8061 30.4067 78.3542 179.8463 24.4888 205.1503 67.0083 20.0669 26.3352 267.3215 1791.8030 25.1285 30.0761 27.5238 8.8627 26.2105 5.1459 20.0130 22.3363 32.0794 2.0731 12.7638 11.0041 35.0238 34.7698 34.4454
temp: 298.150 k
press: 1.00000 atm
elementType: 8 8 8 8 8 7 7 6 6 6 6 6 6 6 6 6 6 6 6 1 1 1 1 1 1 1 1 1 1 1 1 1 1 1 1
symmnumber: 1
zpe: 720176.1 jmol-1
zpe.correction: 0.274301 hartree
zpe.thermalcorrener: 0.293115 hartree
zpe.thermalcorrenthalpy: 0.294059 hartree
zpe.thermalcorrgfe: 0.227158 hartree
zpe.sumelectzpe: -951.076598 hartree
zpe.sumelectthermal: -951.057784 hartree
zpe.sumelectthermalent: -951.056840 hartree
zpe.sumelectthermalfe: -951.123741 hartree
dipole: 3.9126 2.3872 -1.5672
dipole: 4.8439
quadrupole: -113.0299 -93.7585 -116.8202
quadrupole: 12.9031 -20.6399 -2.3989
quadrupole: -5.1604 14.1110 -8.9507 12.9031 -20.6399 -2.3989
hfenergy: -951.3508988 hartree
pointgroup: C01 [X(C12H16N2O5)]
dipole: 1.6897409 0.3482381 -0.8095611 debye
polarizability: 193.2990214|-17.2658894|181.3999941|-26.8461364|-15.3207196|119.8137453 unknown
InChI: InChI=1S/C12H16N2O5/c1-6(13)11(17)14-8(12(18)19)4-7-2-3-9(15)10(16)5-7/h2-3,5-6,8,14-16,18H,4,13H2,1H3
charge 0 multiplicity 1
35 atoms
O  3.668156 -1.736525 -1.163501
O  1.001779 1.166531 1.515578
O  3.286859 -3.125535 0.664759
O  -2.328291 2.000048 -0.88788
O  -4.313563 0.890386 0.735014
N  1.851899 0.056618 -0.358662
N  0.005385 3.110781 -0.201176
C  1.69304 -1.303172 0.168204
C  0.481232 -2.06209 -0.524044
C  -0.844102 -1.371253 -0.25908
C  1.325347 2.477866 -0.523999
C  1.380553 1.170499 0.304903
C  2.948586 -2.142752 -0.023227
C  -1.115003 -0.110005 -0.845726
C  -1.798047 -1.908633 0.635967
C  -2.220114 0.684178 -0.463852
C  2.535074 3.380512 -0.172596
C  -2.978092 -1.186292 0.933997
C  -3.19254 0.109118 0.40889
H  1.484806 -1.219805 1.247961
H  0.701994 -2.118036 -1.608538
H  0.4703 -3.095292 -0.131327
H  2.181196 0.141986 -1.322748
H  1.338791 2.244852 -1.606219
H  -0.4395 0.305998 -1.601177
H  -1.624892 -2.882898 1.106988
H  3.49052 2.894083 -0.441522
H  2.548585 3.59069 0.911507
H  2.476609 4.339008 -0.720897
H  -3.721925 -1.619356 1.616958
H  -0.004245 4.108885 -0.456769
H  -0.163668 3.00302 0.815822
H  4.449539 -2.338188 -1.295427
H  -1.380674 2.449292 -0.793117
H  -4.907191 0.388478 1.348335
