program: Gaussian 09
title: 000210801
version: EM64L-G09RevD.01
frameworkgroup: C1[X(C22H23ClN2O2)]
method: RPBEPBE
basis: SDD
operation: Freq
keyword: #p
keyword: freq=noraman
keyword: PBEPBE/SDD
title: #p freq=noraman PBEPBE/SDD
converged: NO YES NO NO
title: Mulliken charges:
elementType: Cl O O N N C C C C C C C C C C C C C C C C C C C C C C H H H H H H H H H H H H H H H H H H H H H H H
charge: -0.067187 -0.164193 -0.162677 -0.079854 -0.166817 0.051793 -0.437097 -0.354896 -0.366068 -0.366025 -0.423735 -0.405322 -0.065494 -0.054298 -0.726782 0.250605 0.244322 0.533115 -0.380050 -0.378850 -0.209601 -0.210173 -0.297383 -0.341119 -0.221844 -0.242174 -0.247628 0.241006 0.227302 0.194576 0.224565 0.209951 0.197013 0.196236 0.211501 0.227741 0.203091 0.214338 0.231467 0.241362 0.223315 0.243865 0.280716 0.280498 0.241405 0.241426 0.248540 0.250895 0.225967 0.232654
chargesum: 0.00000
title: Mulliken charges with hydrogens summed into heavy atoms:
elementType: Cl O O N N C C C C C C C C C C C C C C C C C C C C C C
charge: -0.067187 -0.164193 -0.162677 -0.079854 -0.166817 0.051793 0.031211 0.064245 0.040896 0.041712 0.007097 0.040484 -0.065494 -0.054298 -0.018240 0.250605 0.244322 0.533115 -0.099333 -0.098352 0.031803 0.031253 -0.297383 -0.092579 0.029051 -0.016207 -0.014974
polarizability: 3.49640792e+02 -4.39830259e+01 2.64255859e+02 8.92228976e+00 -5.14825816e+00 2.10205464e+02
1716.lowfreq: -7.3202 -1.3341 -0.0017 -0.0017 -0.0015 5.8659 13.7548 15.3704 26.9814
frequency: 12.0055 14.2998 26.9178 32.7326 62.0360 74.4668 83.3847 101.2409 118.7308 124.9129 163.5347 170.6554 183.2752 190.7117 212.1775 225.2435 230.7258 239.3396 254.2498 259.5648 276.5125 301.7188 320.8742 325.7677 344.8797 374.9110 391.4481 405.4725 432.9945 446.9528 451.8207 471.2997 488.7481 509.7885 520.9745 538.9636 548.5627 561.2400 622.0048 657.4431 662.8723 668.2135 679.8959 711.4982 722.6411 731.3890 750.2338 752.5069 775.5829 799.4727 802.4825 827.0683 841.0356 850.7424 899.8739 912.4129 920.0407 925.1775 927.4188 950.1669 969.0653 974.1049 983.7542 1002.5039 1009.2687 1012.6982 1015.0983 1025.2978 1041.6047 1050.9954 1061.7010 1067.5406 1080.7266 1090.7563 1098.8917 1119.3078 1125.9717 1142.7089 1155.0454 1162.1422 1171.0590 1179.5055 1185.0494 1193.0240 1203.7053 1234.7200 1240.5695 1244.9409 1266.5261 1275.8263 1283.4288 1294.5107 1304.4285 1314.3682 1339.3723 1345.6260 1358.9025 1363.9878 1372.7659 1377.7376 1379.2487 1399.4235 1406.5149 1427.8267 1446.8279 1450.9900 1451.4242 1453.7288 1456.9581 1461.0884 1466.0567 1469.8622 1474.5708 1479.9802 1481.2415 1558.8757 1586.7035 1597.3919 1605.8475 1626.3746 1651.1953 2844.8195 2867.2873 2880.5199 2904.6075 2923.7443 2984.8556 3002.4308 3021.3315 3035.7138 3045.7469 3054.7719 3071.4157 3084.7041 3097.6103 3101.9427 3131.8680 3136.9721 3149.0740 3150.2659 3158.5930 3161.3013 3171.4316 3173.4199
redmass: 5.7050 6.3601 6.2511 6.2867 4.7179 4.5711 4.1452 7.5276 4.1120 5.0602 6.1319 4.4938 2.6143 2.6375 1.3142 5.1590 2.8434 3.5356 3.1361 3.5558 2.6230 3.2052 3.1874 5.3712 4.7133 3.3666 3.8277 2.6766 3.2926 3.3610 4.2885 3.1228 4.1414 4.8105 7.1877 5.8416 3.7700 5.2928 2.9483 4.0458 3.8471 4.0125 5.7850 3.7355 2.6197 4.0908 1.4842 1.6759 3.1975 3.4991 1.8141 2.1036 1.4268 1.5161 3.8791 1.4929 3.8218 3.6920 1.3968 2.2193 1.3254 2.0987 1.4211 2.8745 4.4066 1.3778 2.1222 1.5188 2.3010 1.7726 2.6250 2.1857 2.4488 2.3729 3.4629 1.8523 2.4349 2.6606 2.5973 1.4230 1.1098 2.0077 1.9879 1.8698 1.3452 1.5103 1.5197 2.2681 1.5772 1.4388 1.6197 1.4332 1.4179 1.2767 1.3053 1.5915 1.6191 2.1923 1.6753 1.5532 1.2987 1.4345 6.8805 2.4723 1.1174 2.4917 2.2669 1.0958 1.1027 1.1381 1.1251 1.0655 1.0553 1.1073 2.4545 5.8964 7.6345 7.6745 6.8320 9.9744 11.7778 1.0704 1.0706 1.0692 1.0685 1.0711 1.0339 1.0602 1.0870 1.0902 1.0900 1.0909 1.1032 1.1001 1.1014 1.0898 1.0855 1.0863 1.0891 1.0901 1.0944 1.0956 1.1004 1.1004
irintensity: 0.6370 1.5016 1.0208 0.4110 0.2431 3.3154 0.3403 5.5726 0.2110 0.3372 2.4579 3.1197 2.6247 0.3291 0.8231 1.9818 0.0954 2.8567 0.9788 0.7127 1.6971 1.7922 26.5606 1.4741 3.8198 1.6369 0.7794 4.8149 4.4257 8.0552 0.4821 3.9177 0.8632 4.9046 1.2586 6.2755 4.7981 15.0841 7.4266 25.9246 0.5969 0.3985 2.4067 3.3957 44.5595 5.9793 46.8551 45.2111 7.5571 1.9385 41.9663 0.5642 0.7144 1.2127 9.5478 0.3880 8.9735 33.4200 1.7433 5.7795 0.5362 15.8966 4.0198 66.2373 55.5596 0.7757 30.6073 5.6208 14.9631 5.1461 8.9735 4.0769 0.8030 3.7237 3.4839 13.4138 22.2880 77.9625 23.9289 30.2495 0.5883 3.1216 0.6128 1.7016 9.4843 142.8139 11.0717 138.3876 38.2548 21.2184 1.5943 18.7629 15.7044 22.8341 7.3451 6.4265 6.9822 9.5089 12.6251 49.0186 30.4033 1.5554 14.7051 11.5938 7.6282 0.5715 0.6169 3.5835 22.7871 88.5218 10.8084 14.6366 4.8967 18.6812 107.1002 2.4172 156.5435 0.6684 90.3640 124.6321 54.8321 104.4903 48.0010 64.9257 70.5320 94.6265 24.6792 19.2366 8.2552 41.2290 39.2227 22.7225 14.0131 26.7859 9.8965 6.1527 6.5162 1.6393 8.9447 4.0679 16.9516 5.2283 25.8908 16.2613
temp: 298.150 k
press: 1.00000 atm
elementType: 17 8 8 7 7 6 6 6 6 6 6 6 6 6 6 6 6 6 6 6 6 6 6 6 6 6 6 1 1 1 1 1 1 1 1 1 1 1 1 1 1 1 1 1 1 1 1 1 1 1
symmnumber: 1
zpe: 1053366.4 jmol-1
zpe.correction: 0.401206 hartree
zpe.thermalcorrener: 0.425651 hartree
zpe.thermalcorrenthalpy: 0.426595 hartree
zpe.thermalcorrgfe: 0.344322 hartree
zpe.sumelectzpe: -1570.180187 hartree
zpe.sumelectthermal: -1570.155743 hartree
zpe.sumelectthermalent: -1570.154799 hartree
zpe.sumelectthermalfe: -1570.237072 hartree
dipole: -2.1495 0.8793 0.8329
dipole: 2.4672
quadrupole: -141.4166 -155.3918 -177.0688
quadrupole: -23.5326 -4.6245 0.3637
quadrupole: 16.5424 2.5673 -19.1097 -23.5326 -4.6245 0.3637
hfenergy: -1570.5813935 hartree
pointgroup: C01 [X(C22H23Cl1N2O2)]
dipole: 0.8510171 -0.3987582 0.2428934 debye
polarizability: 353.0497269|-37.4526085|254.9853859|-17.4224446|17.151259|216.0670027 unknown
InChI: InChI=1S/C22H23ClN2O2/c1-22(20(26)16-6-2-3-7-17(16)21(22)27)10-11-24-12-14-25(15-13-24)19-9-5-4-8-18(19)23/h2-9H,10-15H2,1H3
charge 0 multiplicity 1
50 atoms
Cl -4.592492 -2.62563 -1.162027
O  2.998175 0.667248 2.505725
O  3.845389 1.268415 -2.230508
N  -0.593653 0.671102 -0.513981
N  -3.414655 0.128886 -0.175317
C  3.156362 1.511041 0.159782
C  1.633664 1.731053 -0.071871
C  0.868621 0.44508 -0.452528
C  -1.233803 0.707587 0.824039
C  -1.294583 -0.303504 -1.389162
C  -2.721643 1.087188 0.711562
C  -2.778395 0.071245 -1.518329
C  3.424427 0.5301 1.32868
C  3.851677 0.835626 -1.048542
C  3.84105 2.876646 0.4585
C  4.289445 -0.579745 0.822555
C  4.537872 -0.401771 -0.564018
C  -4.817888 -0.014503 -0.059304
C  4.828987 -1.678355 1.52375
C  5.330883 -1.318005 -1.285811
C  5.623541 -2.599688 0.803393
C  5.871701 -2.421735 -0.587034
C  -5.514124 -1.183107 -0.496171
C  -5.622995 0.993418 0.55756
C  -6.906534 -1.329753 -0.375652
C  -7.016581 0.848112 0.710165
C  -7.672619 -0.30768 0.231347
H  1.500348 2.477432 -0.875828
H  1.225126 2.160869 0.86196
H  1.124797 -0.379132 0.262907
H  1.200469 0.115545 -1.455217
H  -0.722548 1.454976 1.456359
H  -1.154995 -0.284939 1.335239
H  -1.222014 -1.346657 -0.992572
H  -0.825676 -0.278369 -2.390166
H  -3.179681 1.046361 1.715463
H  -2.796922 2.132289 0.328901
H  -2.856235 1.067848 -2.010176
H  -3.296037 -0.66876 -2.146102
H  3.386772 3.326876 1.358587
H  4.925839 2.763852 0.63713
H  3.699195 3.5560 -0.400002
H  4.631055 -1.803758 2.593024
H  5.514748 -1.168161 -2.35448
H  6.056432 -3.46472 1.317738
H  6.490976 -3.152931 -1.118084
H  -5.139913 1.913906 0.899887
H  -7.381242 -2.250826 -0.727544
H  -7.591597 1.648923 1.188283
H  -8.755625 -0.426196 0.335488
