program: Gaussian 09
title: 000210797
version: EM64L-G09RevD.01
frameworkgroup: C1[X(C14H12N4O)]
method: RPBEPBE
basis: SDD
operation: Freq
keyword: #p
keyword: freq=noraman
keyword: PBEPBE/SDD
title: #p freq=noraman PBEPBE/SDD
converged: NO YES NO NO
title: Mulliken charges:
elementType: O N N N N C C C C C C C C C C C C C C H H H H H H H H H H H H
charge: -0.182636 -0.344421 0.027934 0.063041 0.042379 0.347485 0.111853 0.356758 0.141141 -0.081316 -0.346784 -0.120836 -0.397006 -0.758442 -0.824604 -0.238502 -0.227152 -0.282874 -0.262529 0.255545 0.237577 0.274987 0.256558 0.248381 0.227611 0.277550 0.229186 0.235440 0.231910 0.251772 0.249995
chargesum: 0.00000
title: Mulliken charges with hydrogens summed into heavy atoms:
elementType: O N N N N C C C C C C C C C C C C C C
charge: -0.182636 -0.344421 0.027934 0.063041 0.042379 0.347485 0.111853 0.356758 0.141141 -0.081316 -0.091239 -0.120836 -0.159430 0.021484 -0.090257 -0.003062 0.004758 -0.031102 -0.012534
polarizability: 2.75044479e+02 2.88766618e+00 1.49346130e+02 -5.32540959e+00 -2.97678724e+00 1.23607030e+02
1716.lowfreq: -6.6999 -0.0009 -0.0006 0.0006 6.2702 8.1362 35.3483 40.5378 73.1514
frequency: 35.2859 40.4944 73.1445 74.3147 129.0329 141.4101 148.4492 175.0310 184.9779 219.5548 281.8371 285.1796 304.6338 327.4915 351.7818 423.2632 442.5189 456.0123 473.1075 514.3802 521.5437 535.1294 548.1644 569.0840 621.6550 635.4254 641.9064 675.7384 712.7684 725.3321 762.4126 785.6324 829.7109 840.5202 862.6880 870.6998 879.2450 950.4440 956.4755 986.5909 988.7308 991.9614 1007.3444 1040.5071 1044.0755 1046.2225 1049.6437 1074.6822 1091.6630 1123.6392 1175.1946 1199.9088 1219.3167 1246.0253 1275.7808 1283.0413 1301.9535 1311.8104 1362.7300 1375.4932 1394.7682 1400.9033 1421.0662 1434.5121 1445.1958 1462.0277 1469.2099 1476.1123 1478.6536 1486.3117 1505.1123 1555.2270 1591.3107 1614.7190 1630.8984 2980.1023 3000.9971 3058.8564 3079.7643 3093.0486 3127.4003 3132.8006 3136.3504 3140.6214 3148.8739 3158.7824 3168.3173
redmass: 5.8853 4.4041 5.0563 5.3791 4.4694 1.1743 2.0362 1.5409 2.2150 5.2602 5.0254 4.8974 3.6011 4.0300 4.7744 4.9052 6.5730 3.1209 6.1667 4.3403 4.8400 7.4949 5.1245 5.5735 8.3453 4.8921 5.0166 6.9829 6.5565 2.9399 1.4638 4.1242 11.0082 5.9721 1.2637 1.7121 2.7780 1.4024 1.5127 4.0045 1.7042 1.3612 3.0185 2.3497 2.1090 1.5720 1.6853 3.4063 4.0100 1.7600 1.0596 2.7716 4.8223 3.2620 8.0068 1.4646 2.4783 3.2371 3.3961 8.1127 1.2396 1.2326 2.2906 2.1352 1.1806 1.0562 1.0670 4.1173 1.5711 1.6976 6.6370 6.4800 6.5297 6.7512 12.1256 1.0375 1.0380 1.0975 1.0965 1.0988 1.0866 1.0891 1.0892 1.0995 1.0946 1.0978 1.1009
irintensity: 0.4235 0.5871 0.8179 2.8974 0.8619 1.6728 2.6718 1.0553 0.5648 0.7147 0.1760 2.4306 6.1904 0.4338 1.2648 6.4911 1.0571 5.6355 7.2513 0.4491 3.3083 1.0278 4.1677 1.3926 2.4341 3.3929 8.7594 8.6960 3.9066 16.8324 50.5490 4.2995 6.0961 3.5792 25.7870 1.9151 3.2391 0.1061 0.0590 1.5647 0.9169 0.0200 1.8047 18.7009 4.2476 6.0827 6.6422 25.4099 19.8293 15.2919 1.4208 17.1025 21.3894 29.2526 67.3918 2.5752 10.8733 100.4483 61.8550 6.4319 36.2445 11.9543 19.6401 0.9254 98.8395 23.4493 30.5394 8.9056 21.3583 65.0034 115.3260 274.3878 3.6236 4.0914 234.4295 17.2014 6.9718 10.3051 7.0121 23.2593 4.9375 5.9385 3.5194 6.7874 24.1345 40.6527 21.8152
temp: 298.150 k
press: 1.00000 atm
elementType: 8 7 7 7 7 6 6 6 6 6 6 6 6 6 6 6 6 6 6 1 1 1 1 1 1 1 1 1 1 1 1
symmnumber: 1
zpe: 614849.1 jmol-1
zpe.correction: 0.234184 hartree
zpe.thermalcorrener: 0.250004 hartree
zpe.thermalcorrenthalpy: 0.250949 hartree
zpe.thermalcorrgfe: 0.190396 hartree
zpe.sumelectzpe: -833.598150 hartree
zpe.sumelectthermal: -833.582329 hartree
zpe.sumelectthermalent: -833.581385 hartree
zpe.sumelectthermalfe: -833.641937 hartree
dipole: 2.6046 1.5134 0.5715
dipole: 3.0661
quadrupole: -87.9603 -124.8501 -103.2234
quadrupole: 9.6975 1.7158 -6.1555
quadrupole: 17.3843 -19.5055 2.1212 9.6975 1.7158 -6.1555
hfenergy: -833.8323332 hartree
pointgroup: C01 [X(C14H12N4O1)]
dipole: 1.0186704 0.6432052 0.061043 debye
polarizability: 275.1229528|2.4958203|145.7827261|-4.2227678|-9.4291856|127.0919599 unknown
InChI: InChI=1S/C14H12N4O/c1-9-5-3-4-6-11(9)18-10(2)17-13-12(14(18)19)15-7-8-16-13/h3-8H,1-2H3
charge 0 multiplicity 1
31 atoms
O  -0.003019 -2.058636 0.210242
N  0.329636 0.25031 -0.11132
N  -1.494956 1.825073 -0.246743
N  -2.84998 -1.641708 0.126791
N  -3.736065 1.075257 -0.189735
C  1.77331 0.020035 -0.149477
C  -0.193079 1.552402 -0.228887
C  2.49136 -0.167985 1.061475
C  -0.510944 -0.921309 0.054355
C  -1.961699 -0.601797 0.012744
C  2.410748 -0.023919 -1.407023
C  -2.390879 0.760801 -0.142986
C  3.889697 -0.378633 0.960778
C  0.778506 2.703333 -0.332738
C  1.790638 -0.174411 2.405314
C  3.803375 -0.238124 -1.482478
C  4.54376 -0.412325 -0.291134
C  -4.163702 -1.314062 0.078938
C  -4.597938 0.036744 -0.080003
H  1.812494 0.094884 -2.317169
H  4.468005 -0.527047 1.880142
H  0.198203 3.636016 -0.309425
H  1.36026 2.660135 -1.270494
H  1.509298 2.693115 0.49545
H  1.133998 0.70563 2.537879
H  1.154449 -1.073954 2.500661
H  2.520615 -0.18391 3.231617
H  4.300363 -0.276874 -2.457262
H  5.625181 -0.581229 -0.336529
H  -4.884353 -2.133413 0.166768
H  -5.665584 0.280099 -0.118549
