program: Gaussian 09
title: 000216238
version: EM64L-G09RevD.01
frameworkgroup: C1[X(C19H27NO4)]
method: RPBEPBE
basis: SDD
operation: Freq
keyword: #p
keyword: freq=noraman
keyword: PBEPBE/SDD
title: #p freq=noraman PBEPBE/SDD
converged: YES YES NO NO
title: Mulliken charges:
elementType: O O O O N C C C C C C C C C C C C C C C C C C C H H H H H H H H H H H H H H H H H H H H H H H H H H H
charge: -0.296616 -0.298663 -0.203167 -0.198934 -0.303299 -0.078985 -0.475070 -0.586159 -0.526768 0.166707 0.352022 0.120657 -0.412850 0.242253 -0.380181 -0.642819 0.236959 -0.192208 0.236384 -0.186047 -0.688981 -0.691609 -0.688095 -0.692722 0.224801 0.234001 0.197287 0.211908 0.231422 0.250060 0.235443 0.245129 0.237858 0.249595 0.223853 0.226150 0.193785 0.252874 0.249544 0.222246 0.223302 0.235556 0.239270 0.221487 0.220734 0.235097 0.225318 0.220942 0.238316 0.223736 0.218474
chargesum: 0.00000
title: Mulliken charges with hydrogens summed into heavy atoms:
elementType: O O O O N C C C C C C C C C C C C C C C C C C C
charge: -0.296616 -0.298663 -0.203167 -0.198934 -0.058170 0.145817 -0.043782 -0.142829 -0.041265 0.166707 0.352022 0.120657 -0.174992 0.242253 -0.130586 0.000969 0.236959 0.060666 0.236384 0.063497 -0.007875 -0.010117 -0.006738 -0.012196
polarizability: 2.90063280e+02 7.01138229e+00 2.26852686e+02 -2.90811935e-01 1.24241134e+01 1.62826632e+02
1716.lowfreq: 0.0002 0.0005 0.0006 4.9340 6.2754 7.9189 15.6814 30.3085 33.6037
frequency: 14.4728 30.2645 33.5938 37.2224 40.9885 45.2736 49.6274 57.8458 80.7563 87.8240 125.4295 154.3844 161.3838 185.4148 191.0765 199.7217 202.6831 207.1462 214.3630 229.6174 236.8061 251.3663 254.2753 277.6248 283.1685 286.9000 301.3587 332.8118 354.9709 358.0232 393.9669 409.0150 428.4499 449.2481 470.4639 511.5358 529.7759 548.0354 578.2047 595.8790 633.1211 647.9825 649.6451 662.0342 703.1155 706.6126 733.8254 746.3795 787.5399 808.9460 833.5350 838.3785 866.3227 885.4965 899.3741 906.6953 923.6129 927.8092 928.5396 952.9810 963.0194 964.0458 973.7349 997.0936 1034.9630 1037.1508 1061.0656 1063.0892 1101.0853 1101.6630 1105.1852 1105.5160 1108.5944 1114.7528 1132.3696 1139.9322 1149.2379 1166.9868 1172.5575 1174.0037 1193.8677 1220.0556 1232.3603 1242.7155 1252.8249 1300.4853 1306.2323 1307.0438 1308.3560 1329.0240 1336.6757 1337.0838 1338.5654 1367.9094 1375.0347 1376.8290 1381.5615 1394.0663 1395.4961 1421.7952 1434.1397 1448.2920 1453.7975 1462.5424 1464.2700 1464.8502 1470.2132 1470.6478 1472.3228 1474.3587 1476.5629 1478.6281 1482.0518 1489.6740 1492.0796 1496.9506 1591.1991 1610.5648 1666.1419 1676.7834 2880.9544 2943.3956 2965.2581 2972.9655 2982.0758 2985.3064 2985.4786 2986.6422 2987.0187 3012.0556 3024.6021 3027.1886 3037.2797 3040.1622 3059.1661 3070.4438 3081.2783 3082.2587 3085.7155 3087.1518 3090.3936 3090.8315 3098.4018 3098.5978 3128.8501 3168.6423 3437.0856
redmass: 2.8086 4.2808 3.6425 4.4590 3.8737 4.5857 3.4933 5.0557 4.0077 2.8945 2.9664 3.5037 2.7036 3.2965 1.9991 1.8824 1.3692 1.2022 1.8030 1.8677 1.5004 1.9912 1.7649 2.0711 2.8909 2.7337 3.4506 4.9107 4.5343 4.8233 2.8509 3.2395 2.7190 2.9815 2.8371 3.8165 4.9584 4.4082 5.6466 3.2097 1.5969 3.7295 3.3003 4.0519 6.6266 6.9343 4.0421 4.6208 2.5241 3.4612 2.4009 1.9727 3.7179 2.6417 2.1882 1.9070 2.6551 1.1841 1.1667 1.3742 1.4533 1.4582 2.4593 2.4571 2.3273 5.1887 4.4904 2.2097 1.5309 1.5622 2.6596 2.5551 1.8619 1.7630 1.9138 1.3231 1.4579 2.2902 1.8881 1.8716 3.5174 1.6427 1.3190 2.6103 1.5175 1.7759 1.3222 1.3212 1.3275 1.5343 1.5603 1.5312 1.4754 1.7706 1.1880 1.1865 3.7848 1.2026 1.2034 4.1811 1.1363 1.1701 1.2763 1.0610 1.1819 1.1449 1.0660 1.0645 1.0662 1.1302 1.0553 1.0533 1.6140 1.0571 1.0630 1.0441 7.6607 8.3494 10.1251 10.2646 1.0552 1.0663 1.0710 1.0619 1.0782 1.0344 1.0344 1.0350 1.0349 1.0754 1.0947 1.0966 1.0859 1.0859 1.0973 1.0999 1.1005 1.1004 1.0998 1.1001 1.1013 1.1012 1.0997 1.0997 1.0892 1.0957 1.0740
irintensity: 0.3046 0.7735 0.3543 2.1311 1.0359 0.1135 0.4329 0.0736 3.0273 0.9873 1.2210 1.3823 1.9666 0.5812 0.5044 0.7619 0.2863 0.2464 0.2682 1.9848 5.8857 3.0128 0.5253 3.4632 3.1838 9.7461 4.3124 3.7880 2.7883 1.0696 0.6319 2.0629 6.7795 14.0213 0.1711 0.3736 4.1454 8.3158 7.5294 22.1300 92.5348 1.4813 4.4492 3.4719 6.4580 4.7874 4.7018 7.2554 2.2057 34.8854 21.4154 10.9302 7.5410 1.9621 1.5888 9.8114 18.9588 5.2802 5.3464 0.2563 0.4664 0.1974 23.7489 11.0769 28.3736 486.8999 611.1976 10.4771 18.5880 23.1009 1.0239 2.7487 14.9648 14.4223 13.0894 2.3837 2.0370 47.4631 5.0905 1.0688 11.0728 8.1652 1.5938 73.9408 6.0740 10.1415 0.7117 0.6563 0.9469 12.6479 31.6069 45.4404 4.9119 3.3149 20.1639 5.7919 0.2611 42.6020 21.5942 27.9180 4.6510 9.4453 36.3789 14.2996 0.9658 7.4554 8.2910 8.3450 4.4688 15.2382 28.7154 3.1679 45.3087 11.6772 24.1320 17.5666 5.9763 5.4500 80.4049 156.6429 113.9725 26.5115 11.6002 13.9314 52.2127 48.0911 13.4986 18.5215 28.3586 57.3696 20.3942 27.0771 3.7169 3.4410 33.8855 42.2011 52.2166 5.0275 43.9131 45.5993 4.4161 2.4949 33.1500 53.6681 13.5671 7.1765 1.1068
temp: 298.150 k
press: 1.00000 atm
elementType: 8 8 8 8 7 6 6 6 6 6 6 6 6 6 6 6 6 6 6 6 6 6 6 6 1 1 1 1 1 1 1 1 1 1 1 1 1 1 1 1 1 1 1 1 1 1 1 1 1 1 1
symmnumber: 1
zpe: 1117385.2 jmol-1
zpe.correction: 0.425590 hartree
zpe.thermalcorrener: 0.451845 hartree
zpe.thermalcorrenthalpy: 0.452789 hartree
zpe.thermalcorrgfe: 0.366702 hartree
zpe.sumelectzpe: -1094.039969 hartree
zpe.sumelectthermal: -1094.013713 hartree
zpe.sumelectthermalent: -1094.012769 hartree
zpe.sumelectthermalfe: -1094.098856 hartree
dipole: 0.5782 -0.3112 0.1895
dipole: 0.6834
quadrupole: -122.0889 -133.8280 -152.1294
quadrupole: 11.1516 -4.7465 8.1260
quadrupole: 13.9265 2.1874 -16.1139 11.1516 -4.7465 8.1260
hfenergy: -1094.4655582 hartree
pointgroup: C01 [X(C19H27N1O4)]
dipole: -0.23027 -0.1164852 -0.0755345 debye
polarizability: 289.4871191|-8.9289669|226.7120729|1.7177522|-14.2409419|163.5434057 unknown
InChI: InChI=1S/C19H27NO4/c1-11(2)18(21)23-16-9-6-13-10-14(20-5)7-8-15(13)17(16)24-19(22)12(3)4/h6,9,11-12,14,20H,7-8,10H2,1-5H3
charge 0 multiplicity 1
51 atoms
O  -0.823624 0.923396 -0.42023
O  -2.119513 -1.26774 0.717965
O  -0.181814 2.224893 1.425412
O  -2.564949 -1.475073 -1.579939
N  5.732888 -0.059046 -0.447893
C  4.296968 -0.00942 -0.097745
C  3.522764 0.801567 -1.15707
C  3.62404 -1.404772 0.052072
C  2.071481 1.063383 -0.704919
C  1.378644 -0.178367 -0.158792
C  2.108539 -1.34006 0.222976
C  -0.026528 -0.189771 -0.000128
C  1.414997 -2.457251 0.751561
C  -0.707267 -1.314529 0.50603
C  0.012634 -2.457949 0.890555
C  6.637878 -0.647134 0.557228
C  -0.842783 2.100776 0.377725
C  -1.762337 3.143165 -0.245931
C  -2.980272 -1.316034 -0.419484
C  -4.433126 -1.179041 0.019895
C  -0.926577 4.386362 -0.65031
C  -2.871014 3.521755 0.770041
C  -5.173785 -2.516513 -0.249559
C  -5.097524 -0.008888 -0.749044
H  4.218867 0.525245 0.872088
H  4.04631 1.758715 -1.330455
H  3.527824 0.241268 -2.115845
H  3.862041 -1.993132 -0.86118
H  4.066313 -1.957676 0.902737
H  2.070688 1.836772 0.089772
H  1.477791 1.480882 -1.540534
H  5.878076 -0.454254 -1.387351
H  1.98408 -3.344141 1.054037
H  -0.52561 -3.320237 1.294614
H  7.683208 -0.543449 0.214703
H  6.542375 -0.083092 1.503833
H  6.461446 -1.724889 0.79055
H  -2.216877 2.695937 -1.147329
H  -4.440198 -0.968173 1.103403
H  -1.586221 5.15021 -1.099279
H  -0.146817 4.129169 -1.389613
H  -0.435576 4.824906 0.236353
H  -2.422982 3.926708 1.694385
H  -3.489123 2.647207 1.042799
H  -3.533239 4.290653 0.333498
H  -5.145924 -2.761289 -1.326095
H  -4.717637 -3.352696 0.309827
H  -6.229795 -2.428736 0.062713
H  -5.045281 -0.187124 -1.837428
H  -4.599995 0.953943 -0.533068
H  -6.159266 0.07806 -0.45645
