program: Gaussian 09
title: 000210796
version: EM64L-G09RevD.01
frameworkgroup: C1[X(C19H27NO4)]
method: RPBEPBE
basis: SDD
operation: Freq
keyword: #p
keyword: freq=noraman
keyword: PBEPBE/SDD
title: #p freq=noraman PBEPBE/SDD
converged: YES YES NO NO
title: Mulliken charges:
elementType: O O O O N C C C C C C C C C C C C C C C C C C C H H H H H H H H H H H H H H H H H H H H H H H H H H H
charge: -0.276399 -0.232800 -0.267184 -0.247810 -0.064514 0.100706 -0.517439 -0.490858 -0.396895 -0.367624 0.414214 0.219865 -0.335897 -0.384156 -0.368181 -0.522742 -0.252140 -0.251249 0.243540 -0.243959 -0.258788 -0.665721 -0.262598 -0.664478 0.231320 0.222563 0.219067 0.218399 0.214755 0.203597 0.198130 0.204889 0.185593 0.243159 0.236705 0.233302 0.248310 0.253425 0.225908 0.224402 0.229094 0.235095 0.220957 0.252649 0.225197 0.217075 0.234052 0.222527 0.216897 0.248925 0.227115
chargesum: 0.00000
title: Mulliken charges with hydrogens summed into heavy atoms:
elementType: O O O O N C C C C C C C C C C C C C C C C C C C
charge: -0.276399 -0.232800 -0.267184 -0.247810 -0.064514 0.100706 -0.063556 -0.053392 0.021457 0.035395 0.414214 0.219865 0.092855 -0.147451 -0.134879 -0.021007 -0.026233 -0.026847 0.243540 -0.014865 0.197264 0.029200 0.193981 0.028459
polarizability: 2.42204048e+02 9.68016477e+00 2.21522617e+02 -6.17412761e+00 4.58621569e+00 1.99356491e+02
1716.lowfreq: -9.2682 -3.8844 -0.0003 0.0004 0.0007 4.1949 6.6571 15.0946 22.8954
frequency: 6.2729 14.9928 22.8810 31.2722 36.2573 42.7818 49.7230 69.3900 77.5698 91.2568 112.4703 118.5680 139.7625 157.3956 160.6674 199.0961 207.3299 213.3159 235.9190 255.1666 272.4672 304.0478 313.0888 324.1407 335.7040 357.0863 383.2320 402.4262 402.4858 421.1487 454.6963 485.2334 486.5128 499.5322 505.1673 562.7345 573.9859 617.6612 662.4936 672.2668 694.2529 704.6166 720.9530 746.5707 769.2276 786.6525 799.5088 803.2634 811.5039 817.8095 818.8411 848.6108 874.1437 903.5144 913.4883 939.0781 949.7715 974.7865 991.8101 994.0269 996.5373 1011.7390 1017.0249 1021.9373 1028.5372 1046.1895 1052.6451 1069.7419 1087.0729 1092.4453 1095.2755 1097.6335 1120.2594 1125.0920 1137.7825 1154.0580 1156.3256 1163.1160 1168.9106 1171.7995 1174.0520 1190.3520 1201.1491 1203.2523 1243.7308 1272.2135 1277.8547 1278.0023 1293.1169 1297.4345 1308.6202 1318.1260 1333.5316 1344.9174 1351.0460 1354.2762 1355.1339 1373.4094 1376.2332 1388.5689 1390.2679 1399.2910 1433.2482 1445.0789 1454.8344 1458.0520 1461.6310 1462.5624 1464.0890 1467.7638 1469.8851 1474.6717 1483.9105 1484.6125 1484.7217 1488.0439 1589.2899 1606.7817 1621.9609 1639.9125 2846.4180 2853.8025 2870.0639 2992.1296 2992.6508 2994.5531 3012.1393 3014.9772 3028.4410 3029.3831 3029.5175 3038.4156 3042.6263 3076.2052 3077.0189 3087.1010 3087.3010 3088.5989 3091.4391 3093.4316 3117.5959 3119.2297 3123.4018 3133.6059 3151.1048 3160.9402 3170.1050
redmass: 3.7501 4.6215 4.2109 3.9825 3.9107 4.1474 3.5926 3.1215 5.0036 3.7600 2.9668 2.7989 3.8133 3.6038 3.4807 2.4613 1.4574 1.5950 2.7237 2.4695 3.1646 2.6313 3.3359 2.7804 2.7900 3.9100 2.1091 2.7822 3.2457 3.0610 3.5226 3.2557 3.5906 3.9084 3.4840 2.4449 3.2912 6.3610 3.9880 3.6064 3.8876 1.8947 3.5070 2.9959 2.2135 1.3435 2.0677 2.1048 1.4675 1.8185 1.8170 1.2572 2.8760 3.4968 1.5497 2.4710 2.2447 1.4142 3.9140 1.5106 2.3744 2.8046 3.1471 1.7579 2.5788 1.9145 2.5356 3.0367 1.7478 2.3804 2.1918 2.2547 2.6112 2.9245 3.3691 1.7222 1.6797 2.6342 2.0163 3.4058 1.0900 1.1212 1.1899 1.6251 1.3408 1.3577 1.1187 1.1186 1.5334 1.3962 1.4905 1.3489 1.3625 1.3089 1.3813 1.2774 1.3163 1.4406 6.6934 1.2321 1.2328 1.4567 2.2174 1.0866 1.0974 1.0922 1.0595 1.0742 1.0434 1.0837 1.0963 1.2860 1.0550 1.0844 1.0665 1.5851 5.8328 6.3198 9.4271 8.7600 1.0720 1.0708 1.0698 1.0360 1.0361 1.0639 1.0670 1.0682 1.0595 1.0816 1.0595 1.0870 1.0872 1.0998 1.0953 1.0975 1.0974 1.0972 1.1032 1.1033 1.1060 1.1060 1.0846 1.0888 1.0932 1.0939 1.0987
irintensity: 0.0426 0.6007 0.1788 1.1654 0.3073 0.4462 0.1980 0.3407 1.1871 0.5976 3.6066 0.3869 0.4003 1.3254 0.5729 3.2332 3.4207 4.8087 3.0563 0.9682 0.4837 14.7612 11.3368 1.6829 13.8121 9.6527 1.5679 0.1375 1.8466 2.8282 1.4634 1.8845 1.7204 0.6967 10.5560 3.0233 3.2455 0.0528 11.7669 9.7378 7.4102 65.3590 7.9363 6.6988 16.4465 9.2007 5.8955 7.4306 0.9827 3.3958 1.6374 0.0862 1.6665 22.2900 3.0758 13.9719 25.7912 0.9292 1.8154 6.9916 24.3980 27.7339 195.9886 7.6569 8.4025 26.4644 33.7287 47.0294 4.9219 76.6285 37.1820 9.3127 26.8036 149.8255 103.6768 35.5957 17.1677 64.6844 99.5230 85.8425 5.5285 4.3119 2.6293 17.8582 31.6165 8.0442 3.4843 4.1404 2.5826 23.9502 53.4213 1.7145 1.1303 25.2467 3.6504 1.2461 4.6465 35.7331 0.3803 26.7017 23.7919 10.9201 5.6979 20.2484 12.3687 12.5459 27.9062 4.2324 13.6533 0.1785 9.9095 36.5176 16.8580 1.1414 21.5664 8.9226 1.2843 29.7120 127.2966 147.4190 33.6372 49.5904 146.8933 20.5911 21.5255 9.9280 1.5185 28.0879 33.1129 51.4106 23.8803 49.6399 12.2569 23.6134 17.4286 40.3081 32.0429 27.2564 0.6701 1.6945 33.2817 29.5889 0.7064 9.3433 34.3208 28.0065 7.2552
temp: 298.150 k
press: 1.00000 atm
elementType: 8 8 8 8 7 6 6 6 6 6 6 6 6 6 6 6 6 6 6 6 6 6 6 6 1 1 1 1 1 1 1 1 1 1 1 1 1 1 1 1 1 1 1 1 1 1 1 1 1 1 1
symmnumber: 1
zpe: 1124445.3 jmol-1
zpe.correction: 0.428279 hartree
zpe.thermalcorrener: 0.453400 hartree
zpe.thermalcorrenthalpy: 0.454345 hartree
zpe.thermalcorrgfe: 0.367851 hartree
zpe.sumelectzpe: -1094.025483 hartree
zpe.sumelectthermal: -1094.000361 hartree
zpe.sumelectthermalent: -1093.999417 hartree
zpe.sumelectthermalfe: -1094.085911 hartree
dipole: -0.0947 -0.5356 -3.1539
dipole: 3.2005
quadrupole: -128.7344 -134.8910 -144.5338
quadrupole: 2.0133 -1.0869 2.9620
quadrupole: 7.3187 1.1621 -8.4807 2.0133 -1.0869 2.9620
hfenergy: -1094.4537618 hartree
pointgroup: C01 [X(C19H27N1O4)]
dipole: -0.0371196 -0.0081475 1.2585907 debye
polarizability: 242.3846961|-10.4062431|219.1070668|4.3291343|8.1363011|201.5913923 unknown
InChI: InChI=1S/C19H27NO4/c1-3-23-17(21)10-13-20-14-11-19(12-15-20,18(22)24-4-2)16-8-6-5-7-9-16/h5-9H,3-4,10-15H2,1-2H3
charge 0 multiplicity 1
51 atoms
O  3.459921 1.580256 1.075729
O  3.638342 1.712654 -1.241641
O  -5.811296 0.054544 1.127891
O  -5.413451 -0.390405 -1.128898
N  -1.196838 0.292804 -0.490192
C  1.785657 0.38914 -0.238269
C  1.02332 0.650993 -1.569862
C  0.807459 0.764124 0.918447
C  -0.322026 -0.095512 -1.629389
C  -0.526209 0.002139 0.803538
C  2.338844 -1.061108 -0.103429
C  3.037285 1.296492 -0.224472
C  -2.537189 -0.329857 -0.602485
C  2.533178 -1.894608 -1.235079
C  2.734117 -1.562624 1.165608
C  -3.558715 0.321679 0.351307
C  3.08243 -3.189776 -1.102674
C  3.281558 -2.856401 1.302618
C  -4.989276 -0.049599 0.000332
C  3.455837 -3.681036 0.167725
C  4.706632 2.399583 1.206113
C  4.382025 3.894397 1.142407
C  -7.270622 -0.205035 0.918914
C  -7.987983 1.069278 0.46501
H  0.82001 1.735737 -1.635258
H  1.64741 0.400767 -2.443948
H  1.261611 0.579268 1.904733
H  0.597092 1.848405 0.858674
H  -0.842415 0.169684 -2.568599
H  -0.149571 -1.201254 -1.646703
H  -0.348033 -1.097288 0.92967
H  -1.186543 0.323533 1.628691
H  -2.504382 -1.434541 -0.418861
H  -2.897949 -0.189961 -1.637312
H  2.26529 -1.538544 -2.233976
H  2.634289 -0.932065 2.054599
H  -3.382103 0.069185 1.410315
H  -3.458354 1.422298 0.263148
H  3.219847 -3.812376 -1.994047
H  3.577569 -3.217449 2.29424
H  3.881196 -4.685508 0.271321
H  5.40321 2.104905 0.401771
H  5.10862 2.102558 2.18806
H  3.99116 4.166504 0.147924
H  3.637275 4.169454 1.909283
H  5.299931 4.48371 1.325109
H  -7.379877 -1.014191 0.175514
H  -7.616487 -0.545486 1.908084
H  -9.076045 0.882369 0.399308
H  -7.633347 1.385239 -0.530512
H  -7.821903 1.891523 1.182322
