program: Gaussian 09
title: 000216185
version: EM64L-G09RevD.01
frameworkgroup: C1[X(C15H21NO)]
method: RPBEPBE
basis: SDD
operation: Freq
keyword: #p
keyword: freq=noraman
keyword: PBEPBE/SDD
title: #p freq=noraman PBEPBE/SDD
converged: YES YES NO NO
title: Mulliken charges:
elementType: O N C C C C C C C C C C C C C C C H H H H H H H H H H H H H H H H H H H H H
charge: -0.286443 -0.111445 0.048601 -0.426691 -0.474381 -0.398209 -0.407020 -0.492160 -0.384334 -0.177963 -0.345247 0.409004 -0.403923 -0.398947 -0.225901 -0.224455 -0.245006 0.219724 0.207224 0.194779 0.206566 0.205600 0.199171 0.195755 0.197053 0.199685 0.239489 0.239047 0.198951 0.190172 0.224603 0.240119 0.212378 0.227169 0.273241 0.223250 0.224005 0.226538
chargesum: 0.00000
title: Mulliken charges with hydrogens summed into heavy atoms:
elementType: O N C C C C C C C C C C C C C C C
charge: -0.286443 -0.111445 0.268326 -0.024687 -0.062215 -0.003283 -0.010282 -0.013624 0.004788 0.046640 0.107250 0.409004 -0.176754 -0.125706 -0.002652 -0.000450 -0.018467
polarizability: 1.63959140e+02 -1.77484477e+01 1.64916062e+02 1.12998894e+01 5.88960464e+00 1.52056544e+02
1716.lowfreq: -15.2649 -11.7318 -4.2068 -0.0006 -0.0004 0.0003 19.1068 24.4663 29.4142
frequency: 18.9141 23.0676 29.0831 76.9680 105.3648 141.6516 204.6563 212.3047 229.2135 283.5229 314.1023 333.1606 368.7284 393.4269 403.5608 431.2575 439.3218 451.9067 484.1302 507.2921 576.6666 614.9319 691.2311 704.1074 715.8572 732.8164 751.4781 778.6438 783.3243 787.8709 840.3908 857.2777 869.3115 894.7879 897.7503 914.6958 921.2909 924.7613 945.4406 973.0134 980.8276 988.6422 995.6555 1001.7905 1016.5852 1026.5784 1053.4982 1057.7762 1075.1564 1079.2350 1095.4003 1114.7524 1126.6102 1143.7857 1162.6578 1169.9463 1181.0464 1205.9671 1214.1616 1219.0973 1243.4828 1254.6330 1262.9381 1281.6892 1299.1037 1303.9354 1311.5170 1322.2315 1327.6662 1333.0871 1334.7003 1340.8574 1342.1745 1350.3906 1369.5462 1382.7956 1434.1303 1455.7141 1460.9317 1462.3273 1463.7022 1469.3255 1476.5535 1480.5689 1491.3460 1590.3793 1612.3343 2911.8870 2966.4146 2966.6910 2967.0962 2967.5801 2970.9807 2977.5935 2982.6939 3011.2296 3027.4407 3029.4230 3034.3401 3038.3922 3047.1686 3105.5180 3107.8754 3123.4733 3136.7547 3138.9592 3155.2992 3167.9680
redmass: 4.2949 2.8575 4.0259 4.1892 3.6626 3.3248 5.2913 1.7901 2.8763 3.5914 2.0212 3.2684 4.1399 2.4918 2.8873 3.0795 2.2509 2.3669 2.9889 1.7394 4.1048 6.4392 6.9332 3.0329 2.2021 3.0377 3.1186 2.6235 1.5762 2.4308 2.6499 1.2521 1.7593 1.6372 2.3477 2.1824 1.9059 2.1059 4.1829 2.1572 1.4080 6.0163 2.1338 1.4799 2.4906 2.0721 1.5322 1.3220 1.5058 1.5540 1.8906 2.4392 1.8750 1.8867 1.2999 1.0584 1.1138 1.6028 1.8911 1.3308 1.3492 1.2573 1.2471 1.2367 1.4217 1.4169 1.3219 1.4914 1.2855 1.3347 1.3467 1.5125 1.4365 1.4258 1.4521 7.0675 2.2008 1.0917 1.0879 1.0898 1.0969 1.0868 1.1196 2.1359 1.1060 6.2282 6.0809 1.0819 1.0639 1.0659 1.0595 1.0826 1.0608 1.0618 1.0705 1.0671 1.0975 1.0954 1.1010 1.1019 1.1031 1.0931 1.0943 1.0864 1.0927 1.0968 1.0970 1.0973
irintensity: 0.0692 0.0227 0.0475 2.3235 0.6839 2.2318 3.6054 0.1026 0.6285 1.6051 0.3476 0.6118 2.1312 2.0134 0.1842 0.1606 7.3987 2.6391 2.6716 4.1844 7.0583 0.1456 6.1879 9.8779 111.8330 7.0647 58.9196 84.6754 3.7731 18.8415 7.4915 0.4072 3.3206 8.5362 5.3891 1.9265 6.0188 5.0412 48.7363 3.0669 0.4994 0.0595 22.9201 7.9043 16.9744 6.7293 0.4935 0.9447 5.6583 7.1407 45.1417 3.1318 19.2218 0.5587 1.4885 0.3899 1.8575 1.1727 1.4051 3.5577 0.7927 2.4046 2.1901 4.8369 6.0688 7.0516 1.2236 6.7886 9.2940 4.0197 0.9764 1.2424 1.4793 1.4496 8.8567 2.7730 8.1956 1.6954 3.8187 10.0630 21.0206 15.9828 0.7761 19.8704 4.5907 0.9986 11.3384 24.6887 29.9714 39.9881 31.1040 26.2101 22.7672 21.6258 101.9280 69.8730 86.1033 68.0584 3.6595 3.8931 133.4038 23.6770 6.7382 0.7417 30.1141 19.0110 28.3212 11.9357
temp: 298.150 k
press: 1.00000 atm
elementType: 8 7 6 6 6 6 6 6 6 6 6 6 6 6 6 6 6 1 1 1 1 1 1 1 1 1 1 1 1 1 1 1 1 1 1 1 1 1
symmnumber: 1
zpe: 866271.5 jmol-1
zpe.correction: 0.329945 hartree
zpe.thermalcorrener: 0.345080 hartree
zpe.thermalcorrenthalpy: 0.346025 hartree
zpe.thermalcorrgfe: 0.285430 hartree
zpe.sumelectzpe: -712.852064 hartree
zpe.sumelectthermal: -712.836929 hartree
zpe.sumelectthermalent: -712.835984 hartree
zpe.sumelectthermalfe: -712.896579 hartree
dipole: -0.9937 -0.9063 1.2183
dipole: 1.8147
quadrupole: -103.7051 -100.9952 -99.5922
quadrupole: -3.1358 6.8040 3.8183
quadrupole: -2.2742 0.4356 1.8386 -3.1358 6.8040 3.8183
hfenergy: -713.182009 hartree
pointgroup: C01 [X(C15H21N1O1)]
dipole: -0.3897475 0.5972257 -0.0336914 debye
polarizability: 163.7360899|19.8493021|151.3727541|6.6034146|5.4868906|165.8229022 unknown
InChI: InChI=1S/C15H21NO/c1-3-7-13(8-4-1)15-11-16(12-17-15)14-9-5-2-6-10-14/h1,3-4,7-8,14-15H,2,5-6,9-12H2
charge 0 multiplicity 1
38 atoms
O  0.540361 -2.161027 -0.988842
N  -1.254932 -0.703296 -1.575004
C  -1.796216 -0.055686 -0.323801
C  -2.551949 1.234792 -0.732048
C  -2.740741 -0.986547 0.469508
C  -3.140393 1.971687 0.493575
C  -3.345208 -0.257879 1.69639
C  -0.007477 -0.066954 -2.085575
C  -4.07815 1.043349 1.298458
C  1.177456 -0.89606 -1.423051
C  -0.872963 -2.103095 -1.53926
C  1.863371 -0.205156 -0.247522
C  2.599582 0.987561 -0.471508
C  1.798646 -0.734439 1.064135
C  3.242363 1.649115 0.598093
C  2.443124 -0.073929 2.135156
C  3.164254 1.121105 1.908517
H  -0.957316 0.226401 0.354751
H  -3.362921 0.946318 -1.430136
H  -1.876978 1.911993 -1.290653
H  -2.197895 -1.881543 0.827611
H  -3.554141 -1.333329 -0.200937
H  -3.683968 2.877048 0.161515
H  -2.314325 2.316559 1.149855
H  -2.530131 -0.011706 2.408255
H  -4.034555 -0.942959 2.226652
H  0.031972 1.002067 -1.829186
H  0.036075 -0.174956 -3.185027
H  -4.453311 1.561319 2.202242
H  -4.963679 0.792282 0.67846
H  1.933163 -1.132286 -2.20002
H  -1.503717 -2.732651 -0.900271
H  -0.840456 -2.506297 -2.571112
H  2.675631 1.400172 -1.486413
H  1.248922 -1.667422 1.220852
H  3.806619 2.569892 0.410319
H  2.387418 -0.495649 3.145526
H  3.664964 1.631308 2.739197
