program: Gaussian 09
title: 000210791
version: EM64L-G09RevD.01
frameworkgroup: C1[X(C11H16N4O3)]
method: RPBEPBE
basis: SDD
operation: Freq
keyword: #p
keyword: freq=noraman
keyword: PBEPBE/SDD
title: #p freq=noraman PBEPBE/SDD
converged: YES YES NO NO
title: Mulliken charges:
elementType: O O O N N N N C C C C C C C C C C C H H H H H H H H H H H H H H H H
charge: -0.470652 -0.321140 -0.262341 -0.148498 -0.145847 -0.228788 -0.091241 -0.379411 0.143710 -0.445373 0.056171 -0.022788 0.235734 -0.208628 0.212409 -0.698271 -0.609216 -0.601904 0.212551 0.278600 0.221490 0.234597 0.203213 0.269155 0.211152 0.241304 0.199212 0.270849 0.250574 0.249644 0.269670 0.254820 0.252854 0.366389
chargesum: 0.00000
title: Mulliken charges with hydrogens summed into heavy atoms:
elementType: O O O N N N N C C C C C C C C C C C
charge: -0.104264 -0.321140 -0.262341 -0.148498 -0.145847 -0.228788 -0.091241 0.111741 0.143710 0.010714 0.056171 0.180425 0.235734 0.060527 0.212409 -0.046604 0.161851 0.175441
polarizability: 2.04296237e+02 3.34348642e+00 1.76039163e+02 6.89757834e+00 -4.54691428e-01 9.51177118e+01
1716.lowfreq: -7.3603 -2.7802 -0.0007 0.0007 0.0008 2.9751 43.7745 49.8867 81.4741
frequency: 43.7397 49.8718 81.4708 85.2175 95.3348 109.5204 119.1194 132.1303 149.4245 166.7183 198.1547 230.9037 242.9908 276.6867 295.0110 298.1183 343.8964 359.9991 383.5046 394.6773 423.8102 430.6453 445.5577 478.4052 488.5658 538.2976 612.2390 635.1036 639.3285 669.2067 703.3763 739.4256 747.1263 764.3044 781.7831 813.4280 849.0552 909.1067 914.5425 957.3629 959.4140 1006.4613 1030.3885 1050.5773 1072.1389 1101.3421 1124.7254 1129.9974 1132.4138 1158.6905 1168.2593 1201.0094 1221.1155 1233.7475 1255.5355 1264.1561 1277.0762 1302.3857 1328.8605 1335.9776 1346.2072 1361.2603 1371.4136 1381.6187 1399.8600 1413.3272 1425.8108 1428.7855 1451.1897 1464.0607 1469.4028 1473.2904 1474.5533 1477.3193 1477.6923 1489.3153 1504.1822 1568.4259 1610.7127 1640.2438 2975.6822 2996.3060 3002.1797 3010.9714 3011.8851 3016.2262 3054.0469 3071.0959 3083.3620 3095.4057 3101.6792 3107.8269 3142.3423 3145.7954 3240.2056 3366.9384
redmass: 4.7475 3.6083 1.2573 1.4933 1.4851 4.3024 4.1081 3.3960 4.6348 6.4398 3.6076 1.1661 2.6098 3.6272 4.3206 3.6807 3.3056 4.5650 5.4950 7.6577 3.5416 5.1218 4.1978 3.1835 4.1839 5.1611 4.1888 1.3620 2.7997 8.7716 10.8216 5.6768 8.5409 1.7098 5.4604 1.4646 1.9774 3.5631 1.9139 2.5563 2.3540 2.9566 3.9134 3.0425 1.9249 2.8315 1.9081 1.3026 1.3028 1.9903 2.0750 2.5365 3.0773 2.0105 1.7338 4.2700 1.2558 7.0255 1.2700 1.3184 3.1445 1.5185 2.6264 1.2266 1.1917 1.4781 1.3181 1.9284 1.1502 1.2753 1.1775 1.0444 1.0509 1.0717 1.0435 1.2124 2.0357 8.0313 11.1350 9.5642 1.0364 1.0643 1.0806 1.0336 1.0606 1.0330 1.1022 1.0995 1.1046 1.0991 1.1026 1.1022 1.1016 1.1023 1.0989 1.0677
irintensity: 0.3021 0.7457 0.0310 0.0562 0.4396 1.3065 10.9217 6.9430 3.6317 2.5063 3.4309 0.3428 8.1864 0.6263 0.7442 3.2044 9.3830 3.8604 15.0399 15.3542 7.4317 25.6023 8.6990 10.6603 7.6757 1.3804 17.3641 212.7081 91.2720 0.9383 9.8571 9.4512 5.5466 4.4699 0.9301 19.6820 16.7182 4.9665 4.3243 21.4719 4.7839 47.2437 29.4372 9.1311 36.7824 10.4136 36.4724 0.4275 0.1230 12.5719 57.4787 28.1044 22.3993 10.1389 35.5022 25.0135 2.0579 15.7062 5.9469 13.6523 36.2024 37.7257 22.1584 21.2892 51.6707 15.5963 43.5933 122.0545 33.5247 12.9684 14.5128 19.4150 13.8758 4.1966 16.5574 98.9586 83.2141 12.9133 778.9298 341.4959 23.1078 18.5526 29.3905 31.4017 31.8412 22.3207 5.8820 48.0308 47.3465 35.0967 15.6482 14.7713 0.4246 0.8384 1.6464 374.9456
temp: 298.150 k
press: 1.00000 atm
elementType: 8 8 8 7 7 7 7 6 6 6 6 6 6 6 6 6 6 6 1 1 1 1 1 1 1 1 1 1 1 1 1 1 1 1
symmnumber: 1
zpe: 715379.1 jmol-1
zpe.correction: 0.272474 hartree
zpe.thermalcorrener: 0.290215 hartree
zpe.thermalcorrenthalpy: 0.291159 hartree
zpe.thermalcorrgfe: 0.226881 hartree
zpe.sumelectzpe: -872.127124 hartree
zpe.sumelectthermal: -872.109382 hartree
zpe.sumelectthermalent: -872.108438 hartree
zpe.sumelectthermalfe: -872.172716 hartree
dipole: -0.7153 -3.2301 1.3897
dipole: 3.5884
quadrupole: -116.7873 -104.2995 -108.2341
quadrupole: 6.6559 -7.6232 2.7351
quadrupole: -7.0137 5.4742 1.5395 6.6559 -7.6232 2.7351
hfenergy: -872.3995973 hartree
pointgroup: C01 [X(C11H16N4O3)]
dipole: 0.3555921 -1.2959159 -0.432785 debye
polarizability: 203.8228297|-1.2939767|175.4181996|11.2610344|-5.6132424|96.2120829 unknown
InChI: InChI=1S/C11H16N4O3/c1-7(16)4-5-15-6-12-9-8(15)10(17)14(3)11(18)13(9)2/h6-7,16H,4-5H2,1-3H3
charge 0 multiplicity 1
34 atoms
O  3.61454 1.216872 1.005799
O  0.891629 1.624335 0.355064
O  -3.715337 1.403505 -0.551347
N  0.776931 -1.53174 0.489589
N  -2.594506 -0.6368 -0.250851
N  -1.418218 1.467154 -0.084953
N  -1.196595 -2.638417 0.121938
C  2.208948 -1.295844 0.783467
C  -0.200508 -0.549789 0.237558
C  2.982942 -0.715877 -0.42576
C  -1.393092 -1.269805 0.021439
C  4.119442 0.237454 0.034711
C  -0.138297 0.887968 0.191263
C  0.130163 -2.750418 0.405233
C  -2.647816 0.773966 -0.311197
C  4.788444 0.934897 -1.164523
C  -3.822627 -1.426773 -0.472424
C  -1.513963 2.945342 -0.153994
H  2.635381 -2.257845 1.116893
H  2.28066 -0.576262 1.618682
H  3.39398 -1.52402 -1.059129
H  2.28414 -0.13137 -1.053371
H  4.883045 -0.333577 0.59798
H  0.646592 -3.69551 0.556224
H  4.04629 1.521131 -1.7383
H  5.567345 1.627905 -0.803833
H  5.258828 0.202858 -1.848733
H  -4.641713 -0.720234 -0.668971
H  -4.046149 -2.033621 0.420571
H  -3.685166 -2.102981 -1.332325
H  -0.512064 3.351629 0.043191
H  -2.234958 3.309071 0.595766
H  -1.868513 3.253024 -1.151066
H  2.712122 1.539772 0.71411
