program: Gaussian 09
title: 000216227
version: EM64L-G09RevD.01
frameworkgroup: C1[X(C21H29FN2O2)]
method: RPBEPBE
basis: SDD
operation: Freq
keyword: #p
keyword: freq=noraman
keyword: PBEPBE/SDD
title: #p freq=noraman PBEPBE/SDD
converged: YES YES NO NO
title: Mulliken charges:
elementType: F O O N N C C C C C C C C C C C C C C C C C C C C C H H H H H H H H H H H H H H H H H H H H H H H H H H H H H
charge: -0.217171 -0.343190 -0.454760 -0.099918 -0.172535 0.286379 -0.493240 -0.467083 -0.403425 -0.407910 -0.388490 -0.377399 -0.358139 -0.373179 -0.121577 -0.387899 -0.405837 -0.296274 0.225561 0.475921 -0.338264 -0.346559 -0.546629 -0.387292 -0.377945 0.311601 0.224598 0.213191 0.212889 0.220795 0.204925 0.218896 0.218585 0.202927 0.207722 0.189338 0.216727 0.217400 0.192276 0.219643 0.194166 0.209152 0.215562 0.215221 0.201653 0.217340 0.206754 0.232910 0.210960 0.353050 0.241932 0.224321 0.286193 0.247832 0.248296
chargesum: 0.00000
title: Mulliken charges with hydrogens summed into heavy atoms:
elementType: F O O N N C C C C C C C C C C C C C C C C C C C C C
charge: -0.217171 -0.343190 -0.101710 -0.099918 -0.172535 0.286379 -0.055450 -0.033399 0.020396 0.013601 0.008569 0.056728 0.053780 0.030140 0.093985 0.028975 0.018257 0.147596 0.225561 0.475921 -0.096333 -0.122238 -0.260436 -0.139460 -0.129649 0.311601
polarizability: 3.22355943e+02 -3.09739586e+01 2.20199166e+02 1.29993396e+01 1.75892382e+01 1.94742486e+02
1716.lowfreq: -14.0229 -0.0007 -0.0003 -0.0002 1.1698 12.2461 13.3227 16.1103 23.1842
frequency: 12.5911 13.5811 22.9715 28.4676 49.1450 55.9538 67.0615 98.4764 106.1008 112.4366 124.4304 130.5865 157.6163 180.8979 208.2300 216.0647 230.0986 236.3633 241.8009 280.5961 307.1379 323.0755 336.1199 350.2938 354.9545 373.6622 380.6298 387.0453 401.6630 415.0467 429.5168 436.4752 451.1706 460.4045 477.4853 501.3886 505.6596 518.9482 539.2455 551.1845 602.3181 629.9912 632.1854 643.5586 665.4675 682.1064 702.0190 704.3410 777.1575 786.0652 789.6045 797.4893 810.6243 821.1364 833.4383 844.9601 848.6646 880.8243 910.4495 915.4147 918.1459 928.8077 932.2563 937.2891 942.2253 944.2579 968.3333 993.6388 996.6766 1010.0516 1017.5508 1048.3150 1051.8152 1061.7223 1070.0189 1073.9134 1093.1251 1096.9233 1104.0874 1114.5071 1134.8554 1143.5681 1147.5817 1156.5406 1165.1193 1169.1349 1200.9575 1205.9151 1210.5097 1226.1817 1228.4655 1239.6787 1248.5644 1251.9933 1266.3190 1280.9894 1293.2205 1299.9179 1303.6537 1308.3279 1322.9049 1328.1436 1337.0372 1340.6001 1341.8852 1342.4871 1349.6719 1355.6286 1357.9202 1363.0582 1372.5191 1379.5596 1381.6490 1392.7785 1421.8304 1454.6744 1454.8308 1457.0600 1461.3510 1463.5457 1463.8544 1464.2355 1467.3220 1471.9646 1477.6593 1479.2822 1505.0054 1588.9346 1622.1534 2120.1522 2858.5314 2866.1481 2904.0951 2910.8769 2925.9199 2970.7686 2979.3553 2982.5384 2983.1329 2987.8484 2996.2083 3033.0693 3035.3856 3037.5067 3039.6613 3044.7554 3047.6427 3049.4596 3050.3311 3052.9694 3057.7037 3067.3515 3085.3077 3150.7356 3157.4967 3173.0514 3179.0090 3422.3244 3517.7103
redmass: 4.5402 4.3078 3.9413 5.4736 4.6533 3.4233 5.9164 3.9626 4.2587 4.2261 4.8356 3.2650 3.8972 4.4661 4.5890 3.0258 3.9147 2.0227 2.2385 2.5826 2.4985 3.2955 3.2402 4.3668 4.0603 3.7433 4.2191 2.2757 2.3146 3.0182 2.4429 2.8510 2.5774 1.4658 2.5867 2.0565 3.8474 2.8694 4.7451 4.4117 2.6306 6.9386 1.2216 3.1165 1.2625 3.0804 3.9069 3.4829 2.3969 1.4586 3.4512 1.9237 1.7566 2.3242 2.9095 1.7540 1.9155 2.1243 2.2057 1.5873 2.5652 2.4515 1.4498 1.4583 2.1872 2.0935 3.4316 2.7166 2.2177 2.3740 3.3573 1.8641 1.7986 2.1900 1.7822 1.6792 2.2770 1.5199 2.0495 1.3710 1.7574 2.4680 2.2940 1.5467 2.3601 2.0364 1.2083 1.5304 1.8914 1.6768 1.4048 1.4881 1.3646 1.3206 1.2549 1.5978 1.4687 1.3487 1.3602 1.3760 1.3811 1.3878 1.3666 1.4523 1.4498 1.3653 1.3567 1.4680 1.8777 1.5891 1.7310 2.2435 1.3719 1.4356 3.7532 1.0811 1.0879 1.0844 1.0992 1.0850 1.0860 1.0828 1.0998 1.0809 1.1005 1.0917 2.6341 7.4719 6.4738 6.0344 1.0712 1.0696 1.0690 1.0705 1.0681 1.0630 1.0558 1.0618 1.0612 1.0616 1.0625 1.0867 1.0959 1.0890 1.1000 1.0911 1.1022 1.1019 1.0902 1.0964 1.1029 1.1026 1.0889 1.0872 1.0877 1.0963 1.0963 1.1584 1.0651
irintensity: 0.3136 0.0463 0.1389 0.5328 0.5643 1.4989 0.8999 0.8023 0.8441 0.1872 0.5229 0.1605 2.3606 0.5360 1.4591 14.3749 0.7404 1.4576 1.1846 10.5087 2.4283 1.6582 2.3722 1.4001 5.1088 1.0080 8.4081 2.7885 9.1927 0.7982 2.8814 3.3769 13.4468 143.2294 5.2749 4.9771 1.3602 21.7780 7.7156 8.5785 0.6607 0.1003 59.9987 0.7995 84.2814 27.8521 2.8297 2.9085 8.6804 1.3920 22.9062 17.4503 83.6343 0.3739 16.7038 3.2688 8.8758 6.3203 8.8929 13.9200 16.4219 25.8316 9.7784 2.8973 14.8653 11.7354 92.4632 10.8010 31.6091 91.7237 96.2305 1.1907 12.9232 2.2956 15.5290 20.7942 13.6880 0.3086 15.0790 6.3668 2.9606 44.8187 35.5466 33.0586 9.5752 39.2070 2.1421 6.5194 53.3909 13.0293 27.8838 142.4292 11.2252 9.2972 1.1092 24.2433 25.0670 15.9271 9.1222 1.3294 11.0224 10.8101 0.3249 2.9698 0.5755 4.8277 4.7226 1.4877 11.2498 4.1690 17.1879 23.5025 51.5574 11.8332 2.2964 1.4147 0.5794 3.4239 59.0451 11.5851 10.2662 19.6438 15.5172 19.8405 14.2965 4.7284 333.7571 1.5386 36.0581 0.9726 56.6972 91.8782 34.7753 144.4968 99.1202 37.6428 30.0828 21.5514 25.5731 24.5487 20.8771 15.2590 61.4965 25.5647 50.0139 26.7001 17.5677 61.2243 19.4386 63.2310 30.6402 47.6142 21.8431 14.5132 11.1710 12.3770 2.0517 51.4429 21.6084
temp: 298.150 k
press: 1.00000 atm
elementType: 9 8 8 7 7 6 6 6 6 6 6 6 6 6 6 6 6 6 6 6 6 6 6 6 6 6 1 1 1 1 1 1 1 1 1 1 1 1 1 1 1 1 1 1 1 1 1 1 1 1 1 1 1 1 1
symmnumber: 1
zpe: 1214473.7 jmol-1
zpe.correction: 0.462569 hartree
zpe.thermalcorrener: 0.488239 hartree
zpe.thermalcorrenthalpy: 0.489183 hartree
zpe.thermalcorrgfe: 0.403992 hartree
zpe.sumelectzpe: -1175.337196 hartree
zpe.sumelectthermal: -1175.311525 hartree
zpe.sumelectthermalent: -1175.310581 hartree
zpe.sumelectthermalfe: -1175.395773 hartree
dipole: -4.2184 -1.5102 0.0670
dipole: 4.4811
quadrupole: -181.3831 -165.0062 -148.1829
quadrupole: 19.3590 -1.1489 5.9053
quadrupole: -16.5257 -0.1488 16.6745 19.3590 -1.1489 5.9053
hfenergy: -1175.7997644 hartree
pointgroup: C01 [X(C21H29F1N2O2)]
dipole: -1.6617621 0.5588053 0.1854349 debye
polarizability: 321.7283979|34.6881868|207.6093067|-4.2096171|21.2259091|207.9598913 unknown
InChI: InChI=1S/C21H29FN2O2/c1-2-21(10-4-3-5-11-21)26-17-20(25)16-23-12-14-24(15-13-23)19-8-6-18(22)7-9-19/h1,6-9,20,25H,3-5,10-17H2
charge 0 multiplicity 1
55 atoms
F  7.95652 1.878766 0.00997
O  -3.568287 -0.92662 -0.182496
O  -3.015671 -3.440614 -1.101909
N  0.166824 -1.643815 -0.113291
N  2.85654 -0.591813 0.03177
C  -4.111973 0.427813 0.121404
C  -5.074516 0.18697 1.314634
C  -4.903553 0.996982 -1.092268
C  -5.862462 1.461962 1.694564
C  -5.688849 2.276981 -0.716477
C  -6.636759 2.02789 0.480418
C  -1.030493 -2.502575 0.050461
C  0.666845 -1.038335 1.141357
C  1.278608 -2.308147 -0.827439
C  -1.97045 -2.407091 -1.17751
C  1.748695 0.004614 0.818061
C  2.391109 -1.30181 -1.176511
C  -2.60689 -1.015396 -1.305704
C  -2.999862 1.334155 0.504738
C  4.119495 0.054392 0.007317
C  4.911583 0.11295 -1.181126
C  4.664099 0.637321 1.194327
C  -2.059826 2.067983 0.81977
C  6.190839 0.710189 -1.182021
C  5.933324 1.246304 1.198057
C  6.679068 1.270514 0.006735
H  -4.49452 -0.192441 2.174905
H  -5.774258 -0.613059 1.003698
H  -5.606752 0.205063 -1.418577
H  -4.217489 1.208033 -1.932927
H  -6.560099 1.225317 2.520112
H  -5.16069 2.229273 2.077521
H  -4.973971 3.084118 -0.46076
H  -6.262158 2.623485 -1.597403
H  -7.15073 2.967235 0.759873
H  -7.424226 1.30627 0.179472
H  -1.59592 -2.166255 0.939157
H  -0.771195 -3.574903 0.204282
H  1.095104 -1.806796 1.833521
H  -0.173233 -0.5352 1.653026
H  1.718674 -3.132521 -0.210505
H  0.898673 -2.755878 -1.763828
H  -1.408167 -2.633305 -2.101589
H  1.275085 0.833858 0.242257
H  2.138865 0.423532 1.758484
H  3.236685 -1.862867 -1.611747
H  2.011446 -0.588503 -1.945519
H  -1.825444 -0.236441 -1.21915
H  -3.145982 -0.922844 -2.268129
H  -3.714201 -3.083414 -0.491386
H  4.530039 -0.288104 -2.123467
H  4.108808 0.590749 2.135536
H  -1.24984 2.720343 1.09104
H  6.791443 0.753803 -2.095668
H  6.346996 1.683082 2.112042
