program: Gaussian 09
title: 000216183
version: EM64L-G09RevD.01
frameworkgroup: C1[X(C16H19NO3)]
method: RPBEPBE
basis: SDD
operation: Freq
keyword: #p
keyword: freq=noraman
keyword: PBEPBE/SDD
title: #p freq=noraman PBEPBE/SDD
converged: YES YES NO NO
title: Mulliken charges:
elementType: O O O N C C C C C C C C C C C C C C C C H H H H H H H H H H H H H H H H H H H
charge: -0.239373 -0.222142 -0.161189 -0.162351 -0.018467 -0.416409 -0.418714 -0.396745 -0.393318 -0.391436 -0.420863 -0.211526 0.079141 0.469665 0.137536 -0.436040 -0.371692 -0.222849 -0.223413 -0.234837 0.260315 0.192415 0.221650 0.224444 0.180431 0.205121 0.205222 0.206120 0.204603 0.208559 0.189182 0.264888 0.243607 0.255410 0.233254 0.263992 0.230659 0.231660 0.233492
chargesum: 0.00000
title: Mulliken charges with hydrogens summed into heavy atoms:
elementType: O O O N C C C C C C C C C C C C C C C C
charge: -0.239373 -0.222142 -0.161189 -0.162351 0.241848 -0.002344 -0.013839 0.013598 0.017406 0.006305 0.087632 0.043884 0.079141 0.469665 0.137536 -0.202786 -0.107701 0.007809 0.008247 -0.001345
polarizability: 2.12670621e+02 1.79276692e+01 1.93166727e+02 -1.42859509e+01 1.20166820e+01 1.41144573e+02
1716.lowfreq: -4.2580 -0.0009 -0.0007 -0.0004 4.1960 11.6896 25.6703 36.9562 47.2794
frequency: 25.6372 36.9088 47.2056 54.0352 59.7313 90.0212 99.5562 173.9010 191.3505 209.9969 217.1345 250.3796 268.9598 300.2443 332.6947 349.5610 362.9409 402.2672 423.3485 437.3845 464.1604 471.0220 481.9532 505.2810 542.6612 584.5287 613.9974 633.5254 666.5161 705.2816 731.9241 754.9502 767.5574 780.8446 783.2461 838.1606 855.5528 857.7447 881.2073 890.7925 895.8610 918.9790 927.4055 949.0708 981.4498 990.1344 993.2784 1000.9790 1007.9706 1027.3536 1045.9931 1051.8753 1061.3038 1075.0351 1079.5416 1088.3223 1111.7765 1141.7265 1170.9420 1175.1641 1189.2058 1191.8431 1208.5442 1219.5079 1249.0449 1255.3701 1260.3679 1263.5497 1301.7420 1309.1760 1313.6024 1333.0755 1335.9342 1341.4238 1342.0125 1346.3626 1351.8330 1366.0534 1387.6882 1401.5205 1442.9090 1459.1921 1462.5373 1463.0346 1467.9368 1470.2480 1477.9763 1486.2880 1596.2671 1601.4231 1616.8443 1673.0213 2961.7478 2966.9609 2968.7299 2976.8377 2977.3627 2979.1879 3004.8876 3019.8327 3034.5991 3035.8660 3041.6910 3042.2817 3052.9143 3074.0868 3114.8228 3132.0109 3144.8161 3158.2282 3169.9803
redmass: 3.7382 3.1363 4.3455 4.5183 9.0488 5.3619 4.9093 3.7850 3.9742 1.8371 4.9911 3.7299 4.5159 4.1941 1.9887 6.4280 5.7192 2.8301 3.6514 3.3145 3.2136 3.6502 2.8920 3.9931 2.8814 5.3641 6.1423 5.4296 4.2657 1.8302 5.5133 11.8849 1.9199 2.3442 1.4796 2.9221 1.7949 1.4748 2.1242 3.3739 1.5737 1.8336 1.4588 3.7199 1.3942 5.6637 2.6529 1.3468 2.4853 2.2209 2.0663 4.1556 1.2685 1.2610 3.0523 1.7302 2.5628 2.5309 2.3699 1.0573 1.1108 1.5359 1.9598 1.6990 1.6399 1.4422 1.2682 1.3643 1.7293 1.2789 1.2605 1.2998 1.3461 1.4852 1.4598 1.4965 1.3621 1.5224 6.6092 1.8024 2.1663 1.0901 1.0917 1.0894 1.1036 1.0814 1.0992 2.3657 6.2263 10.9642 6.1169 12.8541 1.0638 1.0630 1.0647 1.0620 1.0622 1.0677 1.0835 1.0848 1.0965 1.0949 1.1011 1.1009 1.1020 1.0958 1.0884 1.0866 1.0918 1.0957 1.1007
irintensity: 0.1255 0.8008 0.4517 2.2442 0.3569 0.8901 0.6074 0.9318 1.9500 0.1996 4.5359 2.3677 0.6386 0.5979 0.4628 0.9758 6.5140 0.5512 3.8390 5.7322 0.5965 2.5575 10.4598 5.1485 19.9269 10.0983 0.0590 2.4552 4.9845 49.3370 3.5199 2.4403 48.5101 4.8847 0.3063 0.5514 6.4636 2.3724 4.8683 16.8198 18.5473 0.7972 3.9051 16.5188 0.0462 2.5152 26.2376 1.8791 52.2216 20.7230 41.1052 206.7391 2.5123 1.1363 52.9154 8.2101 0.0691 29.3411 31.4782 0.4192 1.5001 0.9423 20.3939 15.3457 48.8470 23.4962 1.4783 7.1374 18.1626 13.6416 23.4350 2.8257 0.7950 0.6973 0.6538 1.5870 0.2593 2.0937 0.1142 18.4215 12.4197 1.4261 7.8171 9.5494 5.9943 21.9342 2.0977 10.5627 5.0189 288.5373 1.3035 269.2648 25.4983 25.6415 31.7569 33.9059 28.2612 24.7190 24.4506 29.8287 75.9887 52.9484 2.6735 1.7260 93.4831 12.2483 9.5523 0.5184 20.3670 24.1033 14.0621
temp: 298.150 k
press: 1.00000 atm
elementType: 8 8 8 7 6 6 6 6 6 6 6 6 6 6 6 6 6 6 6 6 1 1 1 1 1 1 1 1 1 1 1 1 1 1 1 1 1 1 1
symmnumber: 1
zpe: 842653.8 jmol-1
zpe.correction: 0.320950 hartree
zpe.thermalcorrener: 0.338657 hartree
zpe.thermalcorrenthalpy: 0.339602 hartree
zpe.thermalcorrgfe: 0.273504 hartree
zpe.sumelectzpe: -900.051472 hartree
zpe.sumelectthermal: -900.033765 hartree
zpe.sumelectthermalent: -900.032821 hartree
zpe.sumelectthermalfe: -900.098918 hartree
dipole: 0.0508 -8.4957 0.5979
dipole: 8.5169
quadrupole: -109.7542 -144.0035 -112.6237
quadrupole: 0.1997 -0.8379 4.6013
quadrupole: 12.3729 -21.8763 9.5034 0.1997 -0.8379 4.6013
hfenergy: -900.3724222 hartree
pointgroup: C01 [X(C16H19N1O3)]
dipole: -0.1052762 -3.3354711 0.302468 debye
polarizability: 213.9100578|16.8947035|192.3246052|-14.3817481|11.4708341|140.7472576 unknown
InChI: InChI=1S/C16H19NO3/c18-15-16(19)20-14(12-7-3-1-4-8-12)11-17(15)13-9-5-2-6-10-13/h1,3-4,7-8,13-14H,2,5-6,9-11H2
charge 0 multiplicity 1
39 atoms
O  -1.369942 1.849597 -0.237845
O  2.182958 2.659329 -0.599399
O  -0.340114 3.870185 0.064534
N  1.212567 0.608153 -0.008189
C  2.527416 -0.098398 0.012909
C  2.801368 -0.743807 1.394357
C  2.642109 -1.134398 -1.134184
C  4.187091 -1.434497 1.407335
C  4.028131 -1.825375 -1.108965
C  4.311386 -2.472973 0.267183
C  -0.02533 -0.123083 0.331951
C  -1.186034 0.39245 -0.533294
C  1.173724 1.968965 -0.282556
C  -2.494308 -0.314531 -0.24185
C  -0.214631 2.654973 -0.136229
C  -2.877337 -1.424039 -1.034763
C  -3.310028 0.079726 0.847005
C  -4.055857 -2.143087 -0.735311
C  -4.49193 -0.635161 1.141104
C  -4.865098 -1.751073 0.355984
H  3.277951 0.69561 -0.162421
H  2.021067 -1.499642 1.621932
H  2.748529 0.031946 2.181627
H  2.47979 -0.627462 -2.103874
H  1.853941 -1.909351 -1.027823
H  4.352701 -1.917846 2.388958
H  4.979002 -0.666839 1.291146
H  4.813656 -1.074024 -1.328698
H  4.080018 -2.585325 -1.91175
H  5.320891 -2.926172 0.273847
H  3.587981 -3.296665 0.440882
H  -0.288908 -0.011235 1.403221
H  0.122974 -1.19781 0.134356
H  -0.917897 0.294945 -1.603769
H  -2.261091 -1.722696 -1.892614
H  -3.034716 0.962388 1.4332
H  -4.346986 -2.997449 -1.35619
H  -5.124698 -0.318829 1.977608
H  -5.783446 -2.302899 0.585088
