program: Gaussian 09
title: 000216187
version: EM64L-G09RevD.01
frameworkgroup: C1[X(C14H16N2O6)]
method: RPBEPBE
basis: SDD
operation: Freq
keyword: #p
keyword: freq=noraman
keyword: PBEPBE/SDD
title: #p freq=noraman PBEPBE/SDD
converged: YES YES NO NO
title: Mulliken charges:
elementType: O O O O O O N N C C C C C C C C C C C C C C H H H H H H H H H H H H H H H H
charge: -0.267761 -0.244933 -0.435272 -0.212278 -0.439939 -0.486252 -0.378418 -0.391240 -0.176936 -0.457053 -0.515776 0.228616 -0.140870 0.151535 -0.616181 0.591232 0.164533 -0.521225 -0.389735 0.172074 -0.330950 0.134004 0.271694 0.218263 0.241541 0.244706 0.252873 0.351537 0.311662 0.336622 0.221837 0.249613 0.251960 0.234062 0.222585 0.391874 0.386091 0.375906
chargesum: 0.00000
title: Mulliken charges with hydrogens summed into heavy atoms:
elementType: O O O O O O N N C C C C C C C C C C C C C C
charge: -0.267761 -0.244933 -0.043398 -0.212278 -0.053848 -0.110346 -0.026882 -0.054618 0.094758 0.002752 -0.018196 0.228616 0.170792 0.151535 -0.144732 0.591232 0.164533 -0.269265 -0.155674 0.172074 -0.108364 0.134004
polarizability: 1.76196423e+02 8.48527687e+00 2.08609344e+02 2.15332486e+01 1.53404443e+00 1.57527649e+02
1716.lowfreq: -6.7161 0.0005 0.0007 0.0009 2.0417 6.1840 12.6108 19.3210 20.3963
frequency: 12.1465 19.1579 20.2692 33.3400 46.5896 52.7690 74.7014 77.9181 108.5882 127.2320 153.9121 168.7270 199.2921 226.8017 267.1787 275.3197 277.5629 291.3294 292.3182 339.7296 359.5734 411.2463 434.4945 443.3630 455.7778 494.7401 503.5307 505.0666 519.7465 547.4083 557.5360 568.1249 582.6955 603.2552 605.6023 629.3970 651.4466 684.1678 688.9545 717.5078 738.2475 750.5337 767.2937 790.7219 818.5118 854.7760 864.0267 878.5378 889.6550 907.2716 916.4268 936.8400 975.3057 1001.9779 1013.0107 1042.8209 1071.7863 1080.1385 1096.6385 1119.5928 1143.9004 1149.7435 1154.8467 1181.4926 1190.3492 1200.0689 1234.5758 1242.5681 1253.5410 1263.5040 1271.0885 1275.9119 1289.6353 1292.5636 1300.2170 1311.1358 1317.2315 1324.1062 1333.0165 1381.6756 1409.0217 1454.7217 1466.0458 1471.3443 1474.5832 1493.5961 1505.7146 1611.5475 1612.5731 1632.1784 1669.7339 1672.5898 2925.1960 2997.2978 3010.0063 3015.7736 3045.3163 3064.4232 3075.5420 3099.4023 3122.7437 3146.9069 3152.5053 3522.1472 3525.3266 3550.3767 3564.5866 3624.4495
redmass: 7.6791 5.3738 4.3500 8.7053 8.6354 5.6805 6.3427 6.7084 5.4330 7.1585 2.4452 5.7647 5.1627 5.1760 1.5151 4.2180 2.5861 5.2273 3.9912 4.2789 5.8125 4.2912 3.5102 3.6387 3.7021 1.1269 2.6183 3.4149 3.3825 2.4860 3.2734 5.1850 1.7585 1.8628 1.7273 3.8324 2.2566 3.4213 3.6606 3.7576 5.9395 5.4668 5.1309 1.4900 2.3055 2.3824 2.1326 2.7912 2.2991 2.5335 1.3863 3.5087 3.1572 2.5079 2.5055 2.0983 2.3759 2.3477 2.4847 1.6824 1.2578 1.8384 1.7401 1.4546 1.3293 1.3603 1.8680 1.9188 1.9317 1.4012 1.3431 2.5436 1.4590 1.3626 1.7768 1.4978 1.4950 1.5614 1.6984 2.1216 5.3397 1.0848 1.5992 1.7665 1.1003 1.8897 3.2720 7.1170 7.8303 6.7525 9.2501 9.1791 1.0824 1.0600 1.0589 1.0670 1.0867 1.1003 1.1034 1.1000 1.0879 1.0951 1.0936 1.0643 1.0648 1.0774 1.0785 1.0666
irintensity: 1.5513 1.5211 4.6296 3.4482 1.7109 0.4526 0.6694 3.9980 4.6125 0.3440 0.4781 0.2391 5.9956 15.0780 113.3926 10.2636 50.8304 6.9719 5.5731 7.3751 2.7920 11.6098 9.1123 13.3354 11.3308 133.6456 20.2174 13.6962 14.8758 11.8542 26.2785 8.1658 114.1754 97.9877 86.4502 48.8194 83.5413 32.2009 8.9908 0.2757 2.2456 4.5201 22.7393 47.7607 2.2812 15.4445 5.5545 29.3992 38.5096 7.5300 1.4721 11.9613 5.8953 6.8158 20.0268 4.0056 289.4483 44.6026 81.9676 4.5622 14.0600 16.6559 71.7053 56.8690 23.8690 10.3364 126.1417 57.0642 71.2460 32.5161 0.3128 132.9480 38.3816 13.4149 16.9282 4.7170 40.2760 40.4296 12.1104 50.5976 5.3249 8.2223 29.9653 33.5123 6.4620 188.0305 141.5981 28.1417 158.8260 2.7912 536.3582 215.9033 38.8997 24.0717 27.6521 12.1861 5.9922 11.0206 18.7442 17.0956 13.4693 13.1164 0.8481 38.5610 82.1634 27.7814 56.1998 65.5415
temp: 298.150 k
press: 1.00000 atm
elementType: 8 8 8 8 8 8 7 7 6 6 6 6 6 6 6 6 6 6 6 6 6 6 1 1 1 1 1 1 1 1 1 1 1 1 1 1 1 1
symmnumber: 1
zpe: 763034.8 jmol-1
zpe.correction: 0.290625 hartree
zpe.thermalcorrener: 0.312004 hartree
zpe.thermalcorrenthalpy: 0.312948 hartree
zpe.thermalcorrgfe: 0.236027 hartree
zpe.sumelectzpe: -1102.340547 hartree
zpe.sumelectthermal: -1102.319167 hartree
zpe.sumelectthermalent: -1102.318223 hartree
zpe.sumelectthermalfe: -1102.395144 hartree
dipole: -4.0139 2.3393 3.2883
dipole: 5.6918
quadrupole: -136.8452 -129.9542 -128.2907
quadrupole: 30.2460 26.5903 9.2513
quadrupole: -5.1485 1.7425 3.4060 30.2460 26.5903 9.2513
hfenergy: -1102.6311715 hartree
pointgroup: C01 [X(C14H16N2O6)]
dipole: -1.509708 1.0112792 1.3086625 debye
polarizability: 177.711947|10.3293586|207.4851475|21.4142336|0.2119988|157.1363211 unknown
InChI: InChI=1S/C14H16N2O6/c17-10-3-1-7(6-11(10)18)5-9(14(21)22)16-13(20)8-2-4-12(19)15-8/h1,3,6,8-9,15-18,21H,2,4-5H2
charge 0 multiplicity 1
38 atoms
O  0.753896 -0.052665 -1.723718
O  4.669925 -2.999633 -1.080314
O  1.480829 3.67443 0.937946
O  0.158199 4.675993 -0.69297
O  -2.769534 -2.307349 1.950267
O  -4.099295 -2.838209 -0.33663
N  2.633447 -1.842905 -0.767376
N  0.787808 1.199681 0.244287
C  1.974344 -0.963071 0.201869
C  3.169142 -0.447368 1.072375
C  4.226818 -1.573785 0.942551
C  1.133208 0.103737 -0.524092
C  -0.08327 2.257427 -0.268077
C  3.916596 -2.238504 -0.417317
C  -1.513036 2.249874 0.396723
C  -2.233766 0.93124 0.182295
C  0.514929 3.648604 -0.083437
C  -2.192724 -0.076849 1.178454
C  -2.9252 0.678182 -1.028212
C  -2.82206 -1.31624 0.964742
C  -3.565361 -0.562534 -1.249123
C  -3.508806 -1.555494 -0.254785
H  1.267054 -1.539526 0.839767
H  2.871691 -0.256665 2.117965
H  3.564191 0.491289 0.643053
H  4.1278 -2.334829 1.739196
H  5.266894 -1.211833 0.953997
H  2.188152 -2.073944 -1.657659
H  -0.203714 2.074967 -1.350945
H  1.204854 1.330317 1.16799
H  -1.396884 2.460559 1.476702
H  -2.080255 3.088406 -0.047686
H  -1.6782 0.087349 2.130956
H  -2.962449 1.447601 -1.807299
H  -4.097751 -0.74968 -2.189867
H  1.814019 4.604433 1.057808
H  -3.265905 -3.105198 1.62703
H  -4.534581 -2.992008 -1.208561
