program: Gaussian 09
title: 000216180
version: EM64L-G09RevD.01
frameworkgroup: C1[X(C8H10BrClN2O)]
method: RPBEPBE
basis: SDD
operation: Freq
keyword: #p
keyword: freq=noraman
keyword: PBEPBE/SDD
title: #p freq=noraman PBEPBE/SDD
converged: YES YES NO NO
title: Mulliken charges:
elementType: Br Cl O N N C C C C C C C C H H H H H H H H H H
charge: -0.011193 -0.079815 -0.478103 -0.635453 -0.673023 -0.172743 0.482104 -0.449871 -0.393507 -0.456887 -0.376421 -0.275562 0.688564 0.203322 0.244544 0.218852 0.299719 0.255661 0.371210 0.305751 0.291322 0.319007 0.322523
chargesum: 0.00000
title: Mulliken charges with hydrogens summed into heavy atoms:
elementType: Br Cl O N N C C C C C C C C
charge: -0.011193 -0.079815 -0.106893 -0.038380 -0.031493 0.030579 0.482104 0.013525 -0.093788 -0.201226 -0.376421 -0.275562 0.688564
polarizability: 1.79034115e+02 1.01614454e+00 1.57877247e+02 -6.45803306e+00 2.14713467e-02 6.52987229e+01
1716.lowfreq: -7.3032 -0.0012 -0.0007 0.0011 2.2687 4.3886 22.6249 70.6293 91.2688
frequency: 22.2449 70.6176 91.2683 92.6835 139.0689 165.9009 197.9035 215.1178 265.9082 282.9254 285.5158 312.0315 319.8470 363.7499 413.9479 441.1390 459.6757 482.4397 495.5132 554.8744 586.6828 622.6009 695.6714 714.5346 728.4600 774.1573 793.7276 855.7237 870.4304 912.8631 917.5861 934.6415 1035.8055 1039.2660 1049.0081 1067.5828 1127.7669 1190.6433 1226.3150 1263.0966 1276.1281 1303.0628 1316.1416 1348.9986 1374.0951 1397.3373 1406.5193 1461.0682 1505.8336 1546.1009 1600.0928 1637.0800 1640.7642 2906.3992 2963.2837 3063.1192 3148.5350 3180.0968 3228.1472 3467.0891 3543.5601 3591.8753 3688.5995
redmass: 4.4392 4.2569 8.0258 3.6406 4.9384 9.5753 4.7027 5.8766 6.3304 1.5169 4.3064 6.6341 2.8342 5.6026 3.9844 1.2292 1.1024 4.8058 3.4537 2.9164 4.3337 4.9623 1.2215 9.0681 6.0025 1.1224 4.1727 3.1908 1.5322 1.4873 3.6989 1.4872 1.8104 3.4029 2.5220 3.2872 1.4378 1.9070 1.3144 1.3121 1.1750 1.2348 2.9118 1.2848 2.9379 2.0895 3.7737 1.0893 4.2330 7.4232 1.6574 2.8375 1.0915 1.0832 1.0659 1.0980 1.0920 1.0918 1.0631 1.0463 1.0447 1.0975 1.1044
irintensity: 5.7900 2.8782 0.4595 4.4570 2.1386 0.3573 0.5761 6.0726 1.3093 12.6767 5.1552 1.9518 4.4072 12.7440 31.5874 174.3466 87.6648 0.0960 1.9013 10.4936 18.4299 20.9556 132.4931 79.7509 11.3911 191.1064 9.0022 12.4127 29.5639 13.7671 16.7032 4.0934 33.9295 1.6715 37.8423 58.9330 22.2578 70.3520 8.4281 22.1871 7.6259 9.8119 17.7616 6.2616 100.1367 69.7103 11.7488 9.7235 135.0351 28.2655 71.3091 183.1363 40.6449 61.2867 48.2656 22.3750 2.9543 3.4862 175.3542 1.0065 81.9516 7.8850 48.8777
temp: 298.150 k
press: 1.00000 atm
elementType: 35 17 8 7 7 6 6 6 6 6 6 6 6 1 1 1 1 1 1 1 1 1 1
symmnumber: 1
zpe: 452624.2 jmol-1
zpe.correction: 0.172395 hartree
zpe.thermalcorrener: 0.186120 hartree
zpe.thermalcorrenthalpy: 0.187065 hartree
zpe.thermalcorrgfe: 0.130177 hartree
zpe.sumelectzpe: -968.118634 hartree
zpe.sumelectthermal: -968.104909 hartree
zpe.sumelectthermalent: -968.103965 hartree
zpe.sumelectthermalfe: -968.160853 hartree
dipole: 2.6404 1.5780 2.5567
dipole: 3.9998
quadrupole: -60.5455 -97.9013 -97.1195
quadrupole: 0.8362 6.9694 -3.9847
quadrupole: 24.6432 -12.7126 -11.9307 0.8362 6.9694 -3.9847
hfenergy: -968.2910297 hartree
pointgroup: C01 [X(C8H10Br1Cl1N2O1)]
dipole: -0.8703799 -0.424102 1.2405478 debye
dipolederiv: -0.2301864 -0.2229288 0.0629555 -0.2505962 -0.5527742 0.1689402 0.0636447 0.1637457 -0.1000724 -0.3492615 0.2699598 -0.1441925 0.2620472 -0.5525917 0.2211786 -0.15483 0.2317942 -0.1830319 -0.758794 0.0542973 -0.0533092 0.1903379 -0.5142419 0.0208412 -0.1843462 0.075068 -0.6846209 -0.8780525 0.0823197 0.0172094 0.1297151 -0.2665417 0.1609645 0.0774012 0.1915665 -0.6096195 -1.5054685 -0.0639599 -0.0938502 -0.100148 -0.2415526 -0.1841238 -0.1246382 -0.1820694 -0.6162061 0.4777676 -0.0465428 0.1006069 -0.1287689 0.4109152 0.0205692 0.3865184 -0.0016946 0.3483637 0.0486786 -0.0058029 -0.028969 0.0298759 -0.1435617 0.0308233 -0.0178289 0.0109706 -0.1265933 0.5801309 -0.0882078 0.055228 -0.0318673 0.182244 -0.0633454 -0.261668 -0.072736 0.1159728 -0.1134076 0.1015056 -0.0227508 -0.1455785 -0.1516038 0.0178634 0.1092952 0.0412932 -0.0565896 -0.0223599 -0.1282467 0.0752004 0.1058362 -0.0980078 0.0164234 -0.0285587 -0.0242152 -0.0927764 0.0229037 0.2384971 -0.0612983 0.685696 0.9175271 -0.3300526 -0.2513143 -0.3957764 -0.0422703 0.1219264 -0.1742072 0.1077885 -0.7012795 0.7482648 -0.4275627 0.3032067 -0.3539751 0.0826098 1.2953331 0.0536628 0.1715263 0.1565967 -0.4302353 0.254229 0.1562707 0.2418373 0.0839833 -0.0756965 -0.0453045 -0.0336698 -0.0573847 -0.225506 -0.0379691 -0.0160957 -0.0263894 -0.011354 0.0360247 -0.0379318 -0.0292182 -0.0392525 -0.0604622 -0.0997224 -0.0588815 -0.043187 0.0445058 -0.0279369 0.0589751 -0.0436703 0.0756791 -0.069264 0.1526561 -0.036226 0.1027637 -0.0490517 0.1814459 0.0528359 -0.0251431 0.0458633 0.0652361 0.0317019 -0.0094081 0.0425832 0.1342709 0.0820631 -0.079341 0.0078244 -0.0769891 -0.0008361 0.045866 0.0120641 0.043372 0.1345451 0.347534 0.036308 -0.079431 -0.0196798 0.2750674 -0.0001851 -0.0799997 -0.0264397 0.4555548 0.0883456 0.0022389 0.0419957 -0.0329653 0.2169395 -0.0796454 0.1098918 -0.1247328 0.1717489 0.1295248 -0.0241411 0.0005984 -0.0858441 0.0728342 -0.0465233 0.0270793 -0.0185397 0.3083546 0.2759149 -0.0108495 -0.0148101 -0.0218405 0.2013824 0.065646 -0.0032691 0.0646804 0.3445259 0.2735705 -0.0231362 -0.0106208 0.010547 0.2167682 0.0614269 -0.0183075 0.0600807 0.3477505 unknown
polarizability: 176.5299688|9.5249857|147.0190231|6.640577|-32.3512378|78.6610927 unknown
InChI: InChI=1S/C8H10BrClN2O/c9-5-1-4(7(13)3-11)2-6(10)8(5)12/h1-2,7,13H,3,11-12H2
charge 0 multiplicity 1
23 atoms
Br 2.183286 2.874441 -0.973633
Cl 2.450751 -2.424517 1.152405
O  -2.710321 0.639511 -1.401794
N  -4.38238 0.100234 0.606632
N  3.511561 0.298006 0.306168
C  -2.196423 -0.339932 -0.45579
C  -0.692785 -0.185281 -0.29891
C  -2.945121 -0.11552 0.902418
C  -0.053121 1.025533 -0.655261
C  0.085024 -1.234314 0.248993
C  1.325787 1.176133 -0.451303
C  1.459749 -1.049673 0.442983
C  2.15103 0.152413 0.108038
H  -2.42079 -1.371266 -0.814913
H  -2.549717 0.805688 1.36618
H  -2.74194 -0.959488 1.594163
H  -0.654043 1.817231 -1.109418
H  -0.371777 -2.193572 0.514479
H  -3.65938 0.77841 -1.082659
H  -4.861181 0.747208 1.238687
H  -4.922983 -0.758681 0.459163
H  4.049447 -0.469477 0.700578
H  3.975329 1.163913 0.043492
