program: Gaussian 09
title: 000210783
version: EM64L-G09RevD.01
frameworkgroup: C1[X(C16H14O2S)]
method: RPBEPBE
basis: SDD
operation: Freq
keyword: #p
keyword: freq=noraman
keyword: PBEPBE/SDD
title: #p freq=noraman PBEPBE/SDD
converged: YES YES NO NO
title: Mulliken charges:
elementType: S O O C C C C C C C C C C C C C C C C H H H H H H H H H H H H H H
charge: 0.171295 -0.416363 -0.228738 -0.327328 0.372699 0.579097 -0.594759 0.398282 -0.415573 -0.910878 -0.380428 -0.373496 -0.415327 -0.251095 -0.252652 0.183098 -0.237655 -0.261423 -0.236468 0.283039 0.270245 0.243077 0.292162 0.275879 0.223481 0.229744 0.235440 0.249416 0.226679 0.229898 0.227390 0.230872 0.380392
chargesum: 0.00000
title: Mulliken charges with hydrogens summed into heavy atoms:
elementType: S O O C C C C C C C C C C C C C C C C
charge: 0.171295 -0.035971 -0.228738 -0.044289 0.372699 0.579097 -0.081437 0.398282 -0.415573 -0.342837 -0.156947 -0.143752 -0.179887 -0.001679 -0.025973 0.183098 -0.007757 -0.034033 -0.005596
polarizability: 2.02787143e+02 -1.64966957e+01 1.91786992e+02 -1.07996240e+01 -2.60432592e+01 1.65797226e+02
1716.lowfreq: -3.7302 0.0005 0.0012 0.0015 6.1817 7.3396 34.7423 44.7775 54.7260
frequency: 34.7167 44.7703 54.6993 71.0827 74.0771 129.4964 144.2651 192.1107 212.0267 235.9233 284.1143 298.4829 307.9615 357.6027 392.4205 415.5709 433.8069 447.1604 485.1811 504.7222 521.1706 555.1539 570.2201 589.9758 605.6266 628.0211 628.8327 662.7575 677.0527 718.5689 741.2334 752.2031 764.4155 773.3814 826.9472 830.4378 866.1708 875.9715 891.5527 909.5689 942.3787 951.3764 966.9872 981.7282 988.1826 1024.3928 1036.2017 1048.7838 1053.4151 1065.1918 1100.2722 1131.7296 1149.4156 1171.3914 1176.3171 1179.0017 1192.9772 1202.0415 1227.7798 1239.4025 1253.3320 1270.2124 1285.3860 1295.4240 1330.0787 1368.1962 1375.1216 1394.0162 1422.0546 1439.9633 1453.4122 1462.8682 1471.6275 1483.6688 1574.9225 1588.8754 1595.4135 1612.2873 1666.1783 2999.9683 3008.6816 3029.7121 3078.8745 3099.4243 3121.6145 3127.6309 3129.2601 3137.0176 3144.0668 3149.1589 3162.8582 3165.5145 3507.9653
redmass: 7.4807 7.9992 5.7554 6.7378 4.6555 4.4038 4.2519 5.1269 6.5154 3.8582 5.7501 3.1928 5.0334 5.8427 4.1653 4.7674 3.2614 3.4513 2.8110 4.2469 3.1358 3.8371 4.2660 3.5384 4.3211 4.3249 4.6907 1.5954 5.6106 4.4305 2.3980 1.5347 1.6897 2.3628 3.7172 3.7109 1.4015 1.5999 2.6305 2.0487 1.4103 1.4626 2.0766 1.3268 1.3373 6.4370 3.3852 2.1739 2.3279 2.3505 2.0371 1.5863 1.2173 1.2442 1.0736 1.3990 1.2512 2.2772 1.5424 1.6462 1.5548 1.8839 1.4533 1.4327 1.6377 4.5398 3.0288 2.4935 2.0694 2.1341 1.1788 2.1511 1.1445 2.5205 6.3691 6.5141 6.1422 6.3309 8.3581 1.0656 1.0816 1.0581 1.0941 1.1069 1.0860 1.0847 1.0882 1.0888 1.0936 1.0942 1.1006 1.1009 1.0639
irintensity: 0.4186 2.0238 0.3890 0.8317 0.1990 0.1390 1.3352 1.4648 1.9091 1.3611 1.1218 0.8874 2.1024 0.5987 1.6701 0.1866 1.9300 9.8207 5.6312 0.6849 20.2197 60.0860 14.1251 15.9551 1.6253 16.9259 16.8961 116.9525 7.5029 1.3578 26.3698 63.3335 30.7509 26.2722 3.6765 2.3913 0.0280 0.6047 1.8677 1.7232 2.0487 2.2652 9.1779 0.1229 0.0170 22.1982 73.4064 2.8116 52.8836 175.8377 7.1532 2.0798 5.7185 1.5940 0.8892 1.4315 1.8973 6.6025 9.3045 5.6569 6.4932 6.3255 3.3378 3.6638 41.3846 25.6803 9.3106 6.9187 13.2144 5.1202 42.3466 18.1022 16.2364 18.4830 2.3122 1.4291 4.2229 1.0607 170.3717 8.6742 2.6424 15.9317 7.0736 4.8087 4.6834 0.3838 4.6285 6.9289 24.3506 28.4028 30.3688 26.7415 26.3444
temp: 298.150 k
press: 1.00000 atm
elementType: 16 8 8 6 6 6 6 6 6 6 6 6 6 6 6 6 6 6 6 1 1 1 1 1 1 1 1 1 1 1 1 1 1
symmnumber: 1
zpe: 673157.9 jmol-1
zpe.correction: 0.256392 hartree
zpe.thermalcorrener: 0.272495 hartree
zpe.thermalcorrenthalpy: 0.273439 hartree
zpe.thermalcorrgfe: 0.211784 hartree
zpe.sumelectzpe: -1165.282562 hartree
zpe.sumelectthermal: -1165.266459 hartree
zpe.sumelectthermalent: -1165.265515 hartree
zpe.sumelectthermalfe: -1165.327170 hartree
dipole: -1.1461 -0.5965 1.9970
dipole: 2.3785
quadrupole: -110.5886 -107.2546 -119.6179
quadrupole: 0.6948 -0.3333 -2.4674
quadrupole: 1.8984 5.2325 -7.1309 0.6948 -0.3333 -2.4674
hfenergy: -1165.538954 hartree
pointgroup: C01 [X(C16H14O2S1)]
dipole: -0.3607304 0.3041625 -0.8081181 debye
polarizability: 210.5363993|11.6845315|180.8034607|3.172466|-28.6996809|169.0315007 unknown
InChI: InChI=1S/C16H14O2S/c17-16(18)9-14-12-6-2-1-5-11(12)10-19-15-8-4-3-7-13(14)15/h1-8,14,17H,9-10H2
charge 0 multiplicity 1
33 atoms
S  1.542409 -1.487627 2.06785
O  -2.803966 3.345627 0.059495
O  -2.442626 1.919236 1.853934
C  -0.126074 0.804026 0.464627
C  -0.919189 -0.356811 -0.159995
C  1.340674 0.604032 0.059245
C  -0.684261 2.201977 0.130616
C  -0.937267 -1.611831 0.519229
C  2.102277 -0.440889 0.657797
C  -0.371034 -1.727235 1.908466
C  -1.518288 -0.260284 -1.437956
C  1.951891 1.376772 -0.95949
C  -1.534325 -2.735572 -0.102581
C  3.433009 -0.688405 0.238111
C  -2.131477 -1.380585 -2.041756
C  -2.032748 2.429474 0.788844
C  -2.134296 -2.626405 -1.376208
C  3.285408 1.148985 -1.363396
C  4.029795 0.111286 -0.759525
H  -0.181091 0.710124 1.565651
H  0.006434 2.974104 0.525053
H  -0.784098 2.397544 -0.949184
H  -0.822241 -0.996146 2.598525
H  -0.517819 -2.740914 2.314216
H  -1.504359 0.690904 -1.981015
H  1.380234 2.175654 -1.443501
H  -1.536543 -3.698893 0.421259
H  3.995979 -1.509774 0.694628
H  -2.596057 -1.283059 -3.029282
H  -2.599848 -3.501966 -1.841585
H  3.7353 1.769961 -2.145504
H  5.062047 -0.086132 -1.068386
H  -3.665548 3.500419 0.535216
