program: Gaussian 09
title: 000210782
version: EM64L-G09RevD.01
frameworkgroup: C1[X(C25H25FN6O)]
method: RPBEPBE
basis: SDD
operation: Freq
keyword: #p
keyword: freq=noraman
keyword: PBEPBE/SDD
title: #p freq=noraman PBEPBE/SDD
converged: YES YES NO NO
title: Mulliken charges:
elementType: F O N N N N N N C C C C C C C C C C C C C C C C C C C C C C C C C H H H H H H H H H H H H H H H H H H H H H H H H H
charge: -0.217837 -0.240306 -0.080639 -0.166643 -0.275822 -0.013606 -0.020856 0.018705 -0.359641 -0.374821 -0.389005 -0.383989 -0.355259 -0.518435 0.481995 0.145207 -0.330519 -0.330747 0.032589 0.297406 -0.393857 -0.393467 -0.416141 0.311003 -0.749393 0.181530 -0.427213 0.125571 0.045095 -0.335233 -0.307550 -0.209729 -0.220212 0.189655 0.201347 0.215950 0.186606 0.218297 0.203798 0.203957 0.219508 0.201382 0.233335 0.235121 0.253526 0.221026 0.222372 0.247210 0.247397 0.271504 0.292131 0.251342 0.250778 0.302809 0.260447 0.264988 0.238165 0.239170
chargesum: 0.00000
title: Mulliken charges with hydrogens summed into heavy atoms:
elementType: F O N N N N N N C C C C C C C C C C C C C C C C C C C C C C C C C
charge: -0.217837 -0.240306 -0.080639 -0.166643 -0.275822 -0.013606 -0.020856 0.018705 0.031362 0.027735 0.033089 0.039476 0.079459 -0.029788 0.481995 0.145207 -0.109492 -0.108375 0.032589 0.297406 -0.146647 -0.146071 -0.144637 0.311003 0.044858 0.181530 -0.124405 0.125571 0.045095 -0.074786 -0.042562 0.028436 0.018958
polarizability: 5.88601356e+02 1.53359306e+01 2.89530960e+02 7.78696163e+00 -7.75335588e+00 1.68866364e+02
1716.lowfreq: -31.4505 -5.1029 -0.0017 0.0007 0.0018 1.4829 3.7320 8.9487 12.5796
frequency: -31.4089 8.2272 12.5667 17.4455 24.5859 31.2761 43.7135 62.6667 70.7475 86.8868 103.1433 111.8597 121.3229 141.7689 161.6257 168.2885 177.7743 213.9436 218.5348 222.3597 247.2937 256.9066 262.1061 287.8134 293.5316 318.4597 338.8566 348.2228 359.1118 387.3332 410.5414 411.6862 413.8930 433.3976 453.2876 467.4574 479.5363 486.6121 492.3687 504.1600 524.1612 532.6088 545.0319 553.8030 586.4401 593.3190 620.3946 631.1987 641.9751 677.9476 683.7141 685.9899 693.8445 698.6915 735.9079 750.5152 776.6219 779.5424 791.4168 797.1143 798.8237 804.0952 815.1440 845.3908 853.9169 869.5417 885.6814 904.6868 911.3743 916.1715 924.4447 924.8985 929.6533 951.9956 970.1549 973.3002 991.3865 1000.4246 1006.2278 1011.2351 1026.2862 1034.6457 1048.2248 1055.4975 1067.8243 1074.7510 1090.9045 1094.4506 1115.2046 1117.4942 1138.5240 1148.1176 1156.4669 1159.0279 1172.6716 1175.4958 1198.3021 1204.0453 1212.5502 1214.6626 1225.8093 1244.3742 1246.2184 1258.0898 1266.6845 1287.1118 1290.9592 1294.9829 1303.9481 1308.6695 1321.1309 1343.8176 1349.3332 1353.8759 1355.0248 1366.9944 1370.6660 1379.0680 1382.6982 1384.6816 1401.7549 1402.8609 1415.5237 1422.2149 1436.7867 1438.3399 1456.0117 1458.4596 1458.8692 1461.9359 1465.5976 1466.7974 1470.1747 1474.9383 1476.5671 1506.7362 1528.9470 1545.0670 1553.5190 1580.6074 1588.5210 1616.5156 1624.0938 2847.8650 2857.1240 2891.5938 2919.5721 2925.7956 2974.4632 3001.2754 3024.1101 3038.6816 3043.2861 3054.7125 3058.3032 3062.7322 3078.3232 3128.6129 3138.7852 3152.0494 3159.2263 3159.8123 3166.0109 3176.1069 3180.1288 3184.8205 3189.4806 3221.0242
redmass: 3.2287 6.3680 6.9077 3.6933 4.7734 5.9876 5.0960 6.0729 6.2669 3.0022 5.2792 4.2453 4.0567 5.6913 1.2947 3.7135 2.2901 4.5808 2.1715 4.0497 6.7420 2.6723 4.1953 4.2206 3.5943 6.8653 5.2171 5.5203 5.0281 2.4917 3.0309 3.4606 4.1783 5.0661 3.9277 4.7820 3.8529 4.2843 3.8185 2.6515 7.4056 3.0390 3.3104 4.7162 5.7271 3.7318 7.4666 7.0642 5.9756 5.4113 3.2106 3.2039 3.4124 3.1883 4.3944 5.8482 1.3654 1.2717 6.5508 1.5520 3.1509 1.8527 3.6438 1.5665 6.4373 1.3676 1.6478 3.9885 1.7663 2.3580 4.6429 1.4278 1.4444 2.8091 2.6399 1.3641 2.8497 1.3303 2.6078 2.1299 2.3643 1.8385 1.5425 1.8620 2.9775 3.1672 2.8106 2.3269 1.8482 1.3775 2.1391 2.4532 1.3378 1.5771 1.9162 2.2211 1.9147 1.3382 1.4328 1.9457 2.0572 1.4682 2.6695 2.1984 1.3394 2.4069 1.4746 1.7302 1.3552 1.3645 2.7875 1.6795 2.0881 3.5791 1.4349 2.6181 1.8279 2.2799 4.4545 1.6294 1.3529 1.3408 3.0718 3.7333 1.1712 1.4458 1.8578 1.4506 1.1102 1.0950 3.0624 1.1784 1.0487 3.4153 1.1246 2.5401 8.3237 5.1321 6.5071 8.4929 7.3858 6.5428 6.5334 1.0716 1.0702 1.0708 1.0690 1.0694 1.0600 1.0370 1.0958 1.0885 1.0893 1.0914 1.0895 1.0908 1.0954 1.1012 1.0861 1.0896 1.0880 1.0885 1.0959 1.1006 1.0946 1.0952 1.0932 1.0973
irintensity: 0.1477 0.0192 0.2576 0.1030 0.0751 0.6969 0.2452 2.7404 0.1247 4.3430 0.8879 0.3627 1.4273 0.2089 0.2854 0.0630 3.9161 0.0512 0.4218 24.5391 0.7374 7.7074 0.5785 1.1812 7.4063 16.5837 1.4818 0.4143 6.4097 0.3018 0.3874 4.7447 11.8525 1.5038 2.9182 2.1026 0.7110 0.4159 10.5831 16.9806 0.2471 0.8198 3.5795 9.9284 2.2516 17.1040 0.9818 0.0033 1.4642 0.3528 0.3142 20.3498 2.4359 4.2592 36.9139 1.1987 86.1209 0.3352 47.6590 8.0367 7.6563 89.2744 27.7678 1.1230 4.6387 13.6270 0.1136 134.1134 15.9544 15.7709 6.6114 0.6673 17.8867 62.6808 44.5995 4.8780 8.8631 0.0008 29.6082 6.0660 28.9852 4.5515 3.1471 2.6973 7.1651 1.5292 2.7500 0.3557 5.8593 7.0647 107.7670 47.5169 22.0677 42.7445 25.7549 24.4241 2.4547 5.0297 29.2387 16.8654 7.5691 218.5200 41.6242 16.1085 39.5688 5.0800 23.3516 23.6264 15.7198 35.7861 12.3135 2.8389 48.8872 190.6408 44.3937 48.4872 89.9763 15.2629 258.4786 11.9792 20.0014 6.9772 260.5502 3.1799 1.1253 3.2214 14.3413 14.5095 5.8115 67.4049 167.9718 27.4234 16.1873 56.4209 9.5104 354.2447 79.9234 228.2616 57.4418 118.6045 0.0573 2.3064 40.6067 47.7492 93.3451 89.3724 40.1358 100.4733 31.9090 7.2984 8.6603 32.5015 50.7692 28.9604 31.7642 26.8142 6.2304 2.0040 1.9950 6.0786 17.2657 4.7676 11.7651 27.6028 19.1328 2.1351 0.3154 1.4890
temp: 298.150 k
press: 1.00000 atm
elementType: 9 8 7 7 7 7 7 7 6 6 6 6 6 6 6 6 6 6 6 6 6 6 6 6 6 6 6 6 6 6 6 6 6 1 1 1 1 1 1 1 1 1 1 1 1 1 1 1 1 1 1 1 1 1 1 1 1 1
symmnumber: 1
zpe: 1202032.4 jmol-1
zpe.correction: 0.457830 hartree
zpe.thermalcorrener: 0.485834 hartree
zpe.thermalcorrenthalpy: 0.486778 hartree
zpe.thermalcorrgfe: 0.394666 hartree
zpe.sumelectzpe: -1468.846078 hartree
zpe.sumelectthermal: -1468.818074 hartree
zpe.sumelectthermalent: -1468.817130 hartree
zpe.sumelectthermalfe: -1468.909242 hartree
dipole: 6.3756 1.3520 0.3693
dipole: 6.5278
quadrupole: -211.4254 -197.0055 -193.0847
quadrupole: -0.5069 2.5485 -7.3725
quadrupole: -10.9202 3.4997 7.4205 -0.5069 2.5485 -7.3725
hfenergy: -1469.3039076 hartree
pointgroup: C01 [X(C25H25F1N6O1)]
dipole: -2.5022567 -0.5542763 0.1654701 debye
polarizability: 588.1109727|17.980732|289.5667723|-12.2562789|9.149033|169.3209358 unknown
InChI: InChI=1S/C25H25FN6O/c1-18-21(16-28-32(18)25-17-27-22-4-2-3-5-23(22)29-25)24(33)10-11-30-12-14-31(15-13-30)20-8-6-19(26)7-9-20/h2-9,16-17H,10-15H2,1H3
charge 0 multiplicity 1
58 atoms
F  11.433994 1.619464 -0.295945
O  -0.659506 -2.589415 0.260035
N  3.275221 -0.994116 -0.140087
N  6.093792 -0.276135 0.032613
N  -3.829712 0.378537 -0.004769
N  -2.981732 1.509985 -0.134179
N  -6.065373 -0.420076 0.114518
N  -7.015277 2.265081 -0.264958
C  3.77546 -0.159134 0.975705
C  4.329577 -1.973497 -0.491313
C  5.03956 0.614503 0.566977
C  5.608731 -1.26184 -0.959537
C  1.974071 -1.647666 0.152442
C  0.808903 -0.645508 0.089771
C  7.416955 0.221123 -0.082778
C  -0.564089 -1.32601 0.153255
C  7.839473 1.394818 0.620766
C  8.399003 -0.442601 -0.886333
C  -1.745671 -0.442098 0.073702
C  -3.114045 -0.816605 0.122287
C  9.169852 1.856292 0.557134
C  9.730836 0.014149 -0.953728
C  -1.74009 0.990152 -0.083005
C  10.098996 1.155531 -0.226091
C  -3.714793 -2.179639 0.272423
C  -5.234514 0.6213 -0.033397
C  -5.706739 1.978429 -0.222878
C  -7.426988 -0.147303 0.074921
C  -7.909059 1.204656 -0.117716
C  -8.364057 -1.213662 0.225697
C  -9.31238 1.455756 -0.156878
C  -9.735531 -0.941456 0.184275
C  -10.212145 0.39519 -0.007873
H  4.002207 -0.788789 1.875017
H  3.004898 0.577526 1.265347
H  3.965868 -2.615568 -1.314126
H  4.577759 -2.635121 0.37827
H  4.766071 1.392307 -0.181949
H  5.41376 1.126266 1.469203
H  6.376621 -2.038366 -1.111748
H  5.416024 -0.769657 -1.939883
H  1.974831 -2.168336 1.140839
H  1.801971 -2.429845 -0.608163
H  0.867455 0.097066 0.911017
H  0.889211 -0.066914 -0.852479
H  7.136792 1.968174 1.228948
H  8.139654 -1.325309 -1.474322
H  9.4785 2.752941 1.103132
H  10.470667 -0.505896 -1.569773
H  -0.88628 1.660766 -0.164621
H  -2.898461 -2.913676 0.333975
H  -4.34984 -2.238344 1.17325
H  -4.377974 -2.418645 -0.577003
H  -4.989747 2.793137 -0.335842
H  -7.979305 -2.227703 0.37105
H  -9.646553 2.487246 -0.304436
H  -10.456681 -1.757763 0.299518
H  -11.290568 0.583197 -0.037279
