program: Gaussian 09
title: 000216267
version: EM64L-G09RevD.01
frameworkgroup: C1[X(C20H22N4O6S2)]
method: RPBEPBE
basis: SDD
operation: Freq
keyword: #p
keyword: freq=noraman
keyword: PBEPBE/SDD
title: #p freq=noraman PBEPBE/SDD
converged: YES YES NO NO
title: Mulliken charges:
elementType: S S O O O O O O N N N N C C C C C C C C C C C C C C C C C C C C H H H H H H H H H H H H H H H H H H H H H H
charge: 0.943435 0.943083 -0.287599 -0.447572 -0.546516 -0.545913 -0.547179 -0.542606 -0.436970 -0.463080 -0.715834 -0.715000 -0.222657 0.412021 0.494224 0.459476 -0.516613 -0.399582 0.230301 -0.322200 -0.325159 -0.434669 -0.421188 -0.088249 -0.080141 -0.370124 0.178974 -0.243181 -0.237641 -0.198875 -0.204018 -0.517654 0.237725 0.309122 0.322414 0.275798 0.267551 0.259134 0.273517 0.237446 0.235318 0.222246 0.279448 0.282943 0.280130 0.280499 0.365742 0.331728 0.329071 0.329022 0.334796 0.265867 0.214714 0.234475
chargesum: 0.00000
title: Mulliken charges with hydrogens summed into heavy atoms:
elementType: S S O O O O O O N N N N C C C C C C C C C C C C C C C C C C C C
charge: 0.943435 0.943083 -0.287599 -0.081830 -0.546516 -0.545913 -0.547179 -0.542606 -0.127848 -0.140667 -0.055035 -0.051182 0.015068 0.412021 0.494224 0.459476 -0.240815 -0.132031 0.230301 -0.063067 -0.051642 -0.197223 -0.185869 -0.088249 -0.080141 -0.147877 0.178974 0.036267 0.045302 0.081255 0.076481 0.197402
polarizability: 4.17173183e+02 3.22003655e-01 3.77942346e+02 -5.03145634e+00 4.78980298e+00 2.43994641e+02
1716.lowfreq: -4.9459 -3.1753 -0.0007 0.0008 0.0021 4.7327 8.6430 10.0716 14.7539
frequency: 8.4691 9.9881 14.6363 19.2957 20.4769 32.1070 47.8009 53.1494 58.1983 62.1181 73.3494 96.3792 100.2288 106.9828 113.4269 127.7113 129.8744 142.3218 151.3779 167.8528 179.6254 200.7672 213.1313 220.2647 250.2341 255.5377 264.8438 266.0364 282.0390 287.9298 294.3994 309.0741 328.1334 347.6384 358.0074 358.5958 368.1779 372.3164 373.1580 414.6218 416.4132 417.5297 427.1975 433.7516 438.1364 460.5541 474.7739 477.4593 487.8348 502.9706 517.0553 532.3977 535.3468 571.6281 603.8753 613.9111 622.5185 631.8515 647.4175 668.3141 720.5761 724.4690 725.9748 727.6764 773.7248 794.4144 795.8070 799.9805 814.6119 816.9147 817.7641 821.5883 831.7472 834.5632 835.7831 855.4184 881.1281 905.1830 906.8854 910.0737 936.3852 955.9973 956.8659 967.6672 969.3665 982.3881 982.9335 988.0478 1057.2748 1058.0397 1064.0051 1070.0033 1070.5514 1084.9173 1106.5301 1113.8949 1130.7300 1134.6173 1153.2838 1157.6829 1161.8233 1188.3004 1190.5952 1225.0611 1265.4597 1269.4073 1282.6289 1283.7573 1300.6933 1307.8806 1314.0005 1344.4995 1371.4671 1374.1492 1396.3139 1407.2481 1421.7927 1424.5567 1440.1667 1457.6002 1459.9331 1472.8028 1478.6646 1489.6274 1502.3760 1502.9924 1533.4232 1534.0653 1587.1874 1591.6272 1596.3977 1605.5465 1613.8343 1614.6276 2901.4050 2983.8384 3096.1839 3113.7032 3130.2493 3130.8771 3137.6463 3142.2898 3151.6987 3152.3982 3163.5588 3164.5030 3166.7907 3171.4135 3171.8406 3354.2492 3357.9804 3521.1331 3525.0806 3556.0186 3559.2199 3578.2134
redmass: 7.6242 6.2871 5.9807 7.4691 5.7937 6.4954 2.8924 3.4374 2.5805 4.8320 5.4452 6.8323 6.1629 1.6493 1.6068 2.6077 8.6771 2.3028 5.3476 5.8935 4.0892 5.3882 5.7355 5.2153 6.4508 4.8319 2.7611 2.7095 5.2040 7.7228 8.0553 6.7866 4.7998 1.5259 4.1907 3.6880 4.9865 5.4717 5.3650 3.2190 3.2382 4.3191 8.0522 4.4233 1.3620 2.9250 4.2570 3.6440 1.3092 4.3557 4.3310 2.8142 2.9365 5.0348 6.0479 5.8929 6.5614 5.5296 6.5296 5.3648 3.9289 3.2778 3.4253 5.0726 4.7585 5.6982 4.5731 1.5094 1.8735 1.4533 1.5564 1.2962 1.7737 2.3484 2.6005 3.6173 2.4000 4.1589 3.9748 2.2615 1.3670 1.3494 1.3584 1.3654 1.3641 4.7048 4.7293 4.6016 2.7915 2.5488 2.2798 1.4713 1.5854 2.6804 2.7827 1.2383 1.3630 1.5455 1.3826 1.1931 1.9018 1.1309 1.1290 2.2929 2.6661 1.6034 1.5438 1.6705 1.3188 1.5563 1.6792 1.4727 3.3286 3.0033 5.4324 2.5307 4.5091 4.5303 1.3335 1.0837 1.7384 1.7809 1.0597 2.6098 2.8279 3.0396 1.0859 1.0858 6.3325 5.8749 6.7485 6.1694 6.7515 6.1813 1.0826 1.0347 1.0972 1.0898 1.0894 1.0895 1.1054 1.0915 1.0883 1.0884 1.0954 1.0954 1.0939 1.0964 1.0964 1.0414 1.0414 1.0994 1.0996 1.0771 1.0776 1.0660
irintensity: 0.4612 0.0828 0.3493 0.3603 0.8337 0.4124 9.5789 4.0735 6.8580 0.3822 6.5925 1.0471 4.3455 33.7067 29.9253 3.2620 0.5022 1.0545 3.2196 2.5317 3.0424 2.1243 0.7352 3.8970 9.3499 22.5997 4.2925 3.0604 5.1934 7.1386 1.9903 8.9938 12.6655 59.9010 45.5463 27.8396 13.5626 2.2193 20.1160 30.8026 6.2591 31.1286 62.8554 21.0414 101.5541 2.8092 225.6431 69.1247 95.5926 22.5640 22.0197 63.6982 132.6664 8.4644 28.4387 4.5267 6.8437 31.5161 8.1733 5.9988 4.3162 0.2972 2.2572 13.7849 3.2002 36.8404 34.8098 43.4652 191.1518 103.4048 146.9975 6.1206 71.8954 53.7675 40.4626 9.1008 19.6256 63.7634 67.5112 34.3926 2.9831 0.1480 0.6924 0.6553 0.8096 11.4351 5.9187 57.9127 64.0914 86.8606 45.2389 21.8280 37.4527 125.3587 105.1631 7.2845 27.4948 48.0991 28.6776 27.5481 4.9945 29.3518 31.9926 133.9328 194.5481 122.5322 59.7622 53.5981 34.8975 22.7623 128.4858 16.3082 82.9074 211.2292 3.6239 61.0599 5.8116 10.7827 16.7522 25.7504 85.4878 22.6223 32.4621 394.3445 272.2219 22.5631 15.9119 17.5296 9.4294 3.3756 60.2198 368.7030 29.6753 191.9159 15.7268 78.3568 35.4185 17.7525 9.7358 10.0374 12.2350 2.2217 2.2649 1.7912 2.6563 2.5671 3.1499 17.8823 11.4065 23.5480 24.8136 20.5789 21.7657 56.8980 59.6174 52.7253
temp: 298.150 k
press: 1.00000 atm
elementType: 16 16 8 8 8 8 8 8 7 7 7 7 6 6 6 6 6 6 6 6 6 6 6 6 6 6 6 6 6 6 6 6 1 1 1 1 1 1 1 1 1 1 1 1 1 1 1 1 1 1 1 1 1 1
symmnumber: 1
zpe: 1043367.8 jmol-1
zpe.correction: 0.397398 hartree
zpe.thermalcorrener: 0.431220 hartree
zpe.thermalcorrenthalpy: 0.432164 hartree
zpe.thermalcorrgfe: 0.325740 hartree
zpe.sumelectzpe: -2239.084564 hartree
zpe.sumelectthermal: -2239.050742 hartree
zpe.sumelectthermalent: -2239.049798 hartree
zpe.sumelectthermalfe: -2239.156222 hartree
dipole: 4.7265 10.2002 -2.1236
dipole: 11.4408
quadrupole: -214.4794 -226.4204 -194.4696
quadrupole: 11.2794 -29.2949 2.5035
quadrupole: -2.6896 -14.6306 17.3202 11.2794 -29.2949 2.5035
hfenergy: -2239.4819619 hartree
pointgroup: C01 [X(C20H22N4O6S2)]
dipole: 2.4381247 3.7290554 -0.6405198 debye
polarizability: 415.4185132|-4.5519499|376.8850961|-13.1249769|17.170084|246.8065614 unknown
InChI: InChI=1S/C20H22N4O6S2/c1-30-19-12-13(2-11-18(19)25)20(23-14-3-7-16(8-4-14)31(21,26)27)24-15-5-9-17(10-6-15)32(22,28)29/h2-12,20,23-25H,21-22H2,1H3
charge 0 multiplicity 1
54 atoms
S  4.119519 -4.851901 -0.005914
S  -6.604162 -1.074713 0.572634
O  1.628836 5.036234 1.780829
O  3.809562 5.281172 -0.111397
O  4.452479 -4.808444 1.590286
O  3.53586 -6.169229 -0.76963
O  -7.718891 -0.35384 -0.374151
O  -6.399222 -2.690603 0.650613
N  0.415855 -0.223586 -1.258839
N  -1.230585 1.427051 -0.709701
N  5.704981 -4.44232 -0.873155
N  -6.986435 -0.496648 2.286907
C  0.073278 0.876548 -0.335052
C  1.10899 2.010684 -0.295736
C  1.27971 -1.273334 -0.95708
C  -2.457261 0.826768 -0.404837
C  0.995124 2.998892 0.711389
C  2.166155 2.094018 -1.226991
C  1.897468 4.081285 0.794018
C  2.102608 -1.253129 0.211847
C  -2.533708 -0.486386 0.150287
C  1.343311 -2.404121 -1.830525
C  -3.664617 1.542156 -0.670852
C  2.99622 -3.41814 -0.393175
C  -4.945832 -0.310347 0.19455
C  3.077754 3.169113 -1.158493
C  2.946775 4.171236 -0.171538
C  2.958719 -2.332824 0.496579
C  -3.784787 -1.054712 0.456386
C  2.204112 -3.477473 -1.555122
C  -4.914385 0.97755 -0.370471
C  2.750747 5.588859 2.572676
H  -0.005593 0.440814 0.688353
H  -0.154929 -0.278563 -2.103605
H  -1.23332 2.388044 -1.052985
H  0.198757 2.955061 1.463311
H  2.278062 1.324022 -1.995353
H  2.096675 -0.389139 0.881897
H  -1.626838 -1.071155 0.32572
H  0.704174 -2.437754 -2.720713
H  -3.615344 2.545869 -1.109202
H  3.895165 3.236774 -1.888839
H  3.577403 -2.339838 1.399752
H  -3.859356 -2.069124 0.861377
H  2.241058 -4.357185 -2.205317
H  -5.84567 1.510631 -0.58585
H  4.471197 5.248117 -0.846356
H  5.900118 -5.219217 -1.528269
H  6.435203 -4.341536 -0.14707
H  -6.954294 -1.319394 2.912892
H  -7.920479 -0.052967 2.25562
H  3.446464 6.155524 1.935245
H  3.290755 4.774309 3.091961
H  2.268315 6.247289 3.310291
